Folio,Deleg,Unidmed,Fecha_D,Fecha_M,Fecha_A,Hr_Ini_H,Hr_Ini_M,Hr_Fin_H,Hr_Fin_M,Edad,Sexo,Edocivi,Escolar,Ocupa,Ingreso,Traimss,Sat1,Sat3,Consulta,Motcons2,Retro,Prospe,Preosad,Tmsalud,Mhclinc,Expclaa_A,Expclaa_B,Expclaa_C,Expclaa_D,Expclab_A,Expclab_B,Expclab_C,Expclab_D,Mopin,Explora,Cexplora,Mexapriv,Prevenf_A,Prevenf_B,Prevenf_C,Prevenf_D,Prevmed,Filtrosaux,Temsad,Saduni,Satlarx,Btratou,Calfatna_A,Calfatna_C,Calfatna_D,Calfatna_E,Calfatna_F,Calfatna_G,Calfatna_H,Calfatna_N,Calfatna_K,Calfatna_L,Calfatna_J,Calfatna_M,Calfatnb_A,Calfatnb_C,Calfatnb_D,Calfatnb_E,Calfatnb_F,Calfatnb_G,Calfatnb_H,Calfatnb_N,Calfatnb_K,Calfatnb_L,Calfatnb_J,Calfatnb_M,Infimss,Finfimss,Continf,Cartel,Calfinma_A,Calfinma_B,Calfinma_C,Calfinma_D,Calfinma_E,Calfinmb_A1,Calfinmb_B1,Calfinmb_B2,Calfinmb_B3,Calfinmb_C1,Calfinmb_C2,Calfinmb_D1,Calfinmb_E1,Calfinmb_F,Calfinmb_G,Calfinmb_H,Calfinmb_I,Calfinmb_J,Ordylim1,Ordylim2,Recomuni,Norecom,Corrup,Atn1fam,Caqod,Sat2,Filtrofarm,Tfarsurt,Totmed,Acnomed,Raznosurt,Versurt,Versurt2,Farm1,Farm2,Farm3,Farm4,Confi1_A,Confi1_B,Confi1_C,Confi1_D,Confi1_E,Confi1_F,Confi1_G,Id_Unidad,Cve_Delegaci�N,Delegaci�N,Nivel,Promedio_Diario2011,Estrato,Moscondia,Fe_Finalnr,Fecha,Entidad
73,3,HGZMF 1 La Paz,29,8,12,15,10,15,26,29,1,2,7,1,1,1,2,2,1,4,2,2,2,1,1,1,1,1,1,2,2,2,2,1,1,2,1,1,1,1,1,1,2,,,,1,1,1,2,2,2,2,2,2,2,2,2,2,2,2,,,,,,,,,,,2,,,1,1,2,1,2,2,2,,,,2,2,,,2,2,2,2,2,2,2,1,,2,2,2,2,1,1,1,,,1,1,1,1,,,4,4,4,4,5,4,4,71,3,Baja California Sur,1,728,1,1.00000000000000000000,5.55725190839695000000,2012-08-29,3
35,3,HGZMF 1 La Paz,29,8,12,10,0,10,18,38,2,2,5,1,1,1,2,2,2,4,1,1,1,1,1,1,1,2,1,1,2,,2,1,1,1,1,1,2,1,2,1,1,1,1,1,1,1,1,2,2,1,2,2,2,2,2,2,2,1,2,,,4,,,,,,,,2,,,2,1,2,1,2,2,1,,,,2,2,,,1,1,1,1,1,1,1,1,,2,1,1,1,2,,,,,,,2,,,,5,5,5,5,5,5,5,71,3,Baja California Sur,1,728,1,1.00000000000000000000,5.55725190839695000000,2012-08-29,3
37,7,HGZMF 16 Torre�n,31,8,12,15,52,16,16,34,2,3,5,1,2,1,2,2,2,4,2,1,1,1,2,1,1,1,1,2,2,1,2,1,1,1,1,1,1,1,1,1,1,1,1,2,1,2,1,2,1,2,2,1,1,2,2,2,2,,2,,1,,,1,1,,,,,2,,,2,2,2,1,2,1,,,,,1,2,,1,2,3,2,1,1,97,,1,,2,2,1,2,1,2,1,,,1,1,1,2,95,,3,2,3,1,3,2,2,233,7,Coahuila,1,1043,1,1.00000000000000000000,13.90666666666670000000,2012-08-31,5
38,7,HGZMF 16 Torre�n,31,8,12,16,20,16,34,29,2,1,4,1,3,1,2,2,2,4,1,1,1,1,2,1,1,1,1,2,2,1,2,1,1,2,99,1,1,1,1,1,1,1,1,2,1,2,1,2,2,2,2,1,1,2,2,2,2,,1,,,,,1,1,,,,,2,,,2,1,2,1,2,1,2,,,,2,2,,1,2,1,3,3,1,1,1,1,,2,2,1,2,1,1,1,,,2,,2,,,,3,2,3,1,2,4,4,233,7,Coahuila,1,1043,1,1.00000000000000000000,13.90666666666670000000,2012-08-31,5
12,7,HGZMF 7 Monclova,6,9,12,14,30,14,52,63,1,2,9,1,5,1,2,2,2,4,2,2,1,1,2,2,2,2,2,,,,,2,2,,,1,1,1,2,1,2,,,,1,1,1,2,2,2,2,2,2,2,2,2,2,2,2,,,,,,,,,,,2,,,2,1,2,2,2,2,1,,,,,,,,2,2,2,3,3,2,1,1,,2,2,1,2,2,,,,,,,2,,,,2,2,4,2,2,2,4,237,7,Coahuila,1,761,2,0.12150726488903100000,24.08846153846150000000,2012-09-06,5
2,7,UMF 3 Ramos Arizpe,5,9,12,8,41,9,3,44,1,2,5,1,3,1,2,2,2,4,2,2,2,2,2,1,1,1,2,2,2,2,,3,2,,,1,1,1,1,1,2,,,,1,1,1,2,2,2,2,2,2,2,2,2,2,4,2,,,,,,,,,,,2,,,2,1,1,2,2,2,3,4,4,4,,,,,3,3,2,2,3,97,,1,,2,1,2,3,2,,,,,,,2,,,,1,5,5,1,1,5,5,262,7,Coahuila,1,132,4,0.08118081180811810000,28.03448275862070000000,2012-09-05,5
10,7,UMF-UMAA 89 Saltillo,4,9,12,13,9,13,37,38,2,2,2,1,2,1,2,2,2,4,2,2,3,,2,2,2,2,2,,,,,2,1,1,1,1,1,1,2,1,2,,,,1,1,1,2,1,2,2,2,2,2,2,2,2,2,2,,2,,,,,,,,,2,,,2,1,2,2,2,2,2,,,,,,,,3,2,2,2,2,99,2,1,,2,2,2,3,2,,,,,,,2,,,,1,2,2,3,4,4,4,1956,7,Coahuila,1,468,3,0.09879670677644080000,62.32894736842110000000,2012-09-04,5
59,8,UMF 2 Manzanillo,4,9,12,12,17,12,39,64,2,2,1,1,2,1,2,2,2,4,1,1,1,1,1,1,1,1,2,2,2,2,,2,1,2,1,1,1,2,2,1,1,1,2,2,1,1,1,2,2,2,2,2,1,2,2,2,2,2,2,,,,,,2,,,,,2,,,2,1,1,1,2,2,2,2,2,2,2,2,,,2,2,2,2,2,1,1,1,,2,2,1,2,1,1,1,,,2,,1,2,2,3,2,3,4,2,1,4,4,320,8,Colima,1,341,1,0.18944444444444400000,5.45454545454546000000,2012-09-04,6
65,8,UMF 2 Manzanillo,4,9,12,16,50,17,13,51,1,2,7,1,2,1,3,3,2,4,2,3,1,1,1,1,1,1,2,2,2,2,,2,1,2,2,2,2,2,2,1,1,1,2,1,1,1,1,2,2,2,2,2,1,2,2,2,2,2,2,,,,,,2,,,,,2,,,2,1,2,1,2,2,2,,,,3,2,,,3,2,2,2,4,97,,1,,2,2,2,3,1,1,1,,,1,1,1,1,,,2,2,2,2,2,2,2,320,8,Colima,1,341,1,0.18944444444444400000,5.45454545454546000000,2012-09-04,6
32,10,UMF 31 Iztapalapa,31,8,12,10,35,10,51,32,1,1,9,1,2,1,2,3,2,4,97,2,1,1,1,1,2,1,2,2,,4,,2,2,,,1,1,2,2,1,1,4,1,5,1,1,1,2,2,2,2,2,1,2,2,2,2,2,2,,,,,,2,,,,,2,,,2,1,1,1,2,2,2,3,4,3,3,3,,,3,2,3,99,3,2,2,1,,2,1,1,2,1,1,1,,,1,1,1,1,,,1,2,5,2,2,2,2,389,10,D.F. Sur,1,1849,1,0.17754945265988100000,27.11979166666670000000,2012-08-31,9
30,11,UMF-UMAA 53 G�mez Palacio,31,8,12,13,50,14,9,33,2,2,2,1,2,1,2,2,2,4,1,1,1,1,1,1,1,1,1,2,2,2,2,2,1,1,1,1,1,1,1,1,2,,,,1,1,1,1,1,2,2,2,2,2,2,2,2,99,99,99,99,,,,,,,,,2,,,2,1,1,1,2,2,2,2,2,2,2,2,,,2,3,2,2,2,1,1,1,,2,1,2,2,1,1,1,,,1,1,1,1,,,2,2,4,2,2,5,4,1951,11,Durango,1,525,3,0.18830703012912500000,14.29743589743590000000,2012-08-31,10
36,11,UMF-UMAA 53 G�mez Palacio,31,8,12,17,48,18,9,21,1,1,8,1,3,1,2,2,1,4,1,1,1,1,1,1,2,1,2,2,,2,,1,1,1,1,1,1,1,1,1,2,,,,1,1,1,1,2,2,2,2,1,2,2,2,2,2,2,2,,,,,2,,,,,2,,,1,1,2,1,2,2,2,,,,2,2,,,2,2,2,2,2,99,1,1,,2,99,2,2,1,1,1,,,1,1,1,1,,,2,1,4,2,2,5,5,1951,11,Durango,1,525,3,0.18830703012912500000,14.29743589743590000000,2012-08-31,10
146,16,HGZMF 1 Pachuca,30,8,12,11,14,11,34,60,2,2,5,1,2,1,2,2,2,4,1,1,2,1,1,1,2,2,2,1,,,,1,1,1,1,1,1,1,1,1,2,,,,1,1,1,2,2,2,2,2,2,2,2,2,2,2,2,,,,,,,,,,,2,,,2,1,2,2,2,2,2,,,,,,,,4,3,2,1,2,3,2,1,,2,1,2,2,2,,,,,,,2,,,,5,3,5,2,2,5,5,719,16,Hidalgo,1,1165,1,1.00000000000000000000,7.28125000000000000000,2012-08-30,13
11,17,UMF 171 Zapopan,3,9,12,11,26,11,37,28,2,2,5,1,3,1,1,1,2,4,2,2,1,1,1,1,2,1,1,1,,1,1,1,2,,,1,1,2,2,2,1,1,1,1,1,2,1,2,1,2,2,2,1,2,2,2,2,,1,,1,,,,1,,,,,2,,,1,1,1,1,2,2,1,5,5,5,1,1,,,1,1,1,1,1,1,1,1,,2,2,1,1,1,1,1,,,1,1,1,1,,,2,2,2,2,2,2,2,757,17,Jalisco,1,1149,1,0.08251346499102330000,49.37943262411350000000,2012-09-03,14
21,23,UMF 2 Puebla,31,8,12,18,42,18,55,59,2,3,4,1,4,1,2,2,2,4,99,99,1,1,1,1,2,1,1,1,,1,1,1,1,1,1,1,1,1,1,1,2,,,,1,1,1,2,2,2,2,2,1,2,1,2,2,1,1,,,,,,1,,1,,,2,,,1,1,1,1,2,2,1,1,1,5,1,1,,,1,1,1,99,99,1,1,1,,1,99,1,1,1,1,1,,,1,1,2,,,,1,2,5,1,1,2,5,1142,23,Puebla,1,1095,1,0.20221606648199400000,18.80208333333330000000,2012-08-31,21
40,23,UMF 12 San Pedro Cholula,3,9,12,11,2,11,18,59,2,2,2,1,3,1,1,1,2,4,2,99,1,1,1,1,1,1,1,1,1,2,1,1,1,1,1,1,1,1,1,1,1,4,1,1,1,1,1,2,2,1,2,2,2,2,1,2,2,1,1,,,1,,,,,1,,,2,,,1,1,2,1,1,1,1,,,,1,1,1,1,1,1,1,1,1,97,,1,,2,99,1,1,2,,,,,,,1,1,,,4,4,5,1,1,1,5,1147,23,Puebla,1,581,2,0.13126976954360600000,17.02307692307690000000,2012-09-03,21
16,29,UMF 21 Para�so,4,9,12,14,50,15,0,29,2,1,9,1,5,1,2,2,2,4,1,1,1,1,2,1,2,1,2,1,,1,,1,1,1,1,1,1,1,1,1,2,,,,1,1,1,2,1,2,2,2,1,2,2,2,2,3,2,,2,,,,2,,,,,2,,,2,1,1,1,1,1,1,1,1,1,2,2,1,2,1,1,1,1,1,1,1,1,,2,2,1,1,1,1,1,,,1,1,1,1,,,4,4,5,1,1,5,5,1459,29,Tabasco,1,73,2,0.07960741548527810000,15.28333333333330000000,2012-09-04,27
19,29,UMF 47 Villahermosa,30,8,12,10,33,10,50,46,2,2,2,1,2,1,2,2,2,4,1,1,1,1,1,1,1,2,2,1,1,,,1,2,,,2,2,2,2,1,1,3,2,2,1,2,2,2,1,2,2,2,2,2,2,2,2,,,,2,,,,,,,,,2,,,2,2,2,1,2,2,,,,,1,1,,,1,2,2,99,99,1,1,1,,2,2,1,2,2,,,,,,,1,2,1,1,4,4,4,2,4,4,4,1947,29,Tabasco,1,485,1,0.23986152324431300000,6.39873417721519000000,2012-08-30,27
2,35,UMF 3 Guadalupe,31,8,12,8,36,8,45,42,2,2,6,1,3,1,1,1,2,4,2,99,1,1,99,1,1,2,2,1,1,,,1,99,,,1,1,1,1,1,2,,,,1,1,1,1,1,2,2,2,2,2,2,2,2,1,1,1,1,,,,,,,,,2,,,2,1,1,2,2,2,1,1,1,1,,,,,1,1,1,1,1,1,1,1,,1,1,1,1,99,,,,,,,1,1,,,1,1,1,1,1,1,1,1779,35,Zacatecas,1,180,4,0.21505376344086000000,6.06521739130435000000,2012-08-31,32
4,35,UMF 3 Guadalupe,31,8,12,9,17,9,34,87,2,2,1,1,1,1,1,1,2,4,2,1,1,1,99,1,1,1,2,2,2,1,,2,1,1,1,1,1,1,1,1,2,,,,1,1,1,1,2,2,2,2,2,2,2,2,2,1,1,1,,,,,,,,,,2,,,1,1,1,2,2,2,1,1,1,1,,,,,1,1,1,1,1,1,1,1,,2,2,1,1,1,1,1,,,1,2,1,2,1,1,1,1,1,1,1,2,5,1779,35,Zacatecas,1,180,4,0.21505376344086000000,6.06521739130435000000,2012-08-31,32
85,3,HGZMF 1 La Paz,29,8,12,16,7,16,22,42,1,1,1,1,2,1,2,1,2,5,2,1,1,1,1,1,1,1,1,2,2,2,2,1,1,2,1,1,1,1,1,1,1,1,1,2,1,2,2,1,2,2,2,2,1,2,2,2,2,,,2,,,,,2,,,,,2,,,2,1,2,1,2,2,2,,,,3,2,,,2,2,2,2,2,99,99,1,,2,2,1,2,1,1,1,,,1,1,1,1,,,4,4,5,3,1,5,2,71,3,Baja California Sur,1,728,1,1.00000000000000000000,5.55725190839695000000,2012-08-29,3
45,4,UMF 10 Santa Luc�a,30,8,12,13,35,13,50,47,2,4,8,1,3,1,2,1,2,5,1,2,1,1,1,1,1,1,1,2,1,1,2,1,1,1,1,1,1,1,1,1,1,2,1,1,1,1,1,2,1,2,2,2,1,2,1,2,2,2,2,,2,,,,1,,1,,,2,,,1,1,1,1,2,1,2,1,1,1,1,1,,1,2,99,1,2,1,2,1,1,,2,1,1,1,1,1,1,,,2,,1,1,,,2,2,2,1,1,2,2,96,4,Campeche,1,249,1,0.14318573893042000000,5.79666666666667000000,2012-08-30,4
43,7,UMF 66 Torre�n,30,8,12,11,0,11,19,28,1,2,9,1,3,1,2,2,2,5,2,1,2,1,1,1,2,1,2,2,,2,,1,1,2,1,1,1,1,1,1,1,2,1,2,1,1,1,2,2,1,2,2,1,2,2,2,2,2,2,,,2,,,2,,,,,2,,,1,1,1,1,2,2,1,3,3,2,2,2,,,2,3,2,99,3,2,99,1,,2,99,1,2,2,,,,,,,1,1,,,3,5,5,2,5,5,5,232,7,Coahuila,1,999,2,0.15950822289637600000,18.15362318840580000000,2012-08-30,5
54,7,UMF 73 Saltillo,4,9,12,11,53,12,11,47,2,2,3,1,2,1,2,2,2,5,2,2,1,1,1,1,1,1,1,1,1,1,1,1,1,1,1,1,1,1,2,2,2,,,,1,1,1,2,2,2,2,2,1,1,2,2,2,2,2,,,,,,2,2,,,,2,,,2,1,1,1,2,2,3,4,4,4,2,3,,,2,4,3,2,2,2,99,1,,2,2,1,3,1,1,1,,,2,,1,1,,,2,1,4,2,2,5,5,235,7,Coahuila,1,932,2,0.14881047421363600000,21.59655172413790000000,2012-09-04,5
3,7,HGZMF 7 Monclova,6,9,12,8,59,9,25,30,1,2,7,1,3,1,3,2,2,5,3,3,1,1,1,1,1,1,1,2,2,2,2,2,2,,,2,2,1,2,1,1,1,1,3,1,1,1,2,2,2,2,1,2,2,2,2,2,4,2,,,,,2,,,,,,2,,,2,1,2,2,2,2,2,,,,,,,,3,2,2,2,2,97,,99,,2,1,2,2,2,,,,,,,2,,,,4,4,4,2,2,4,4,237,7,Coahuila,1,761,2,0.12150726488903100000,24.08846153846150000000,2012-09-06,5
17,7,HGZMF 7 Monclova,6,9,12,16,52,17,16,24,2,1,9,1,5,1,1,1,2,5,1,1,1,1,1,1,1,1,1,1,1,1,1,2,1,2,1,1,1,1,1,1,2,,,,1,1,1,2,2,2,2,2,2,2,2,2,2,1,1,,,,,,,,,,,2,,,2,1,2,2,2,2,2,,,,,,,,2,2,2,2,2,97,,1,,2,2,2,2,2,,,,,,,2,,,,2,5,5,2,2,5,5,237,7,Coahuila,1,761,2,0.12150726488903100000,24.08846153846150000000,2012-09-06,5
19,7,HGZMF 7 Monclova,6,9,12,17,49,18,8,32,2,2,6,1,4,1,2,2,2,5,1,2,1,1,2,1,1,1,1,1,1,1,1,2,2,,,1,1,2,2,1,2,,,,1,1,1,2,2,2,2,2,2,2,2,2,2,4,2,,,,,,,,,,,2,,,2,1,2,2,2,2,2,,,,,,,,2,2,2,2,2,97,,1,,2,2,3,3,2,,,,,,,2,,,,5,5,5,1,2,5,5,237,7,Coahuila,1,761,2,0.12150726488903100000,24.08846153846150000000,2012-09-06,5
12,7,UMF 3 Ramos Arizpe,5,9,12,13,40,14,7,49,2,2,5,1,3,1,4,4,2,5,2,2,1,2,1,1,1,1,1,3,3,3,3,2,2,,,1,1,1,2,2,2,,,,1,1,1,2,1,2,2,2,2,2,2,2,2,3,2,,3,,,,,,,,,2,,,2,1,1,2,2,2,4,2,3,3,,,,,3,3,3,3,3,97,,1,,2,2,2,3,2,,,,,,,2,,,,1,1,5,1,1,5,5,262,7,Coahuila,1,132,4,0.08118081180811810000,28.03448275862070000000,2012-09-05,5
5,7,UMF-UMAA 89 Saltillo,4,9,12,9,32,9,50,43,1,2,5,1,3,1,3,3,2,5,2,2,1,1,2,1,1,1,1,2,2,2,2,3,2,,,1,1,2,1,2,2,,,,1,1,1,2,1,2,2,2,2,2,2,2,2,1,2,,2,,,,,,,,,2,,,2,1,2,2,2,2,2,,,,,,,,2,2,2,2,2,97,,1,,1,2,2,3,2,,,,,,,2,,,,1,2,3,3,3,3,4,1956,7,Coahuila,1,468,3,0.09879670677644080000,62.32894736842110000000,2012-09-04,5
2,11,UMF 32 El Vergel,3,9,12,9,10,9,35,24,2,1,5,1,3,1,2,2,1,5,2,99,3,,1,1,1,1,1,1,1,1,1,1,2,,,1,1,1,1,1,2,,,,1,1,1,2,2,2,2,2,2,2,2,2,2,2,2,,,,,,,,,,,2,,,2,1,2,1,2,2,2,,,,2,2,,,3,4,2,2,2,97,,1,,2,1,2,2,2,,,,,,,2,,,,1,1,3,1,1,1,3,453,11,Durango,1,70,4,0.05388760585065440000,10.47580645161290000000,2012-09-03,10
29,15,UMF 9 Acapulco,4,9,12,12,16,12,31,31,1,2,7,1,2,1,1,1,2,5,1,1,1,1,1,1,1,1,2,2,2,2,,2,2,,,1,1,2,1,2,2,,,,1,1,1,2,2,2,2,2,1,1,2,2,2,1,2,,,,,,1,1,,,,2,,,2,1,1,1,1,1,2,2,2,2,2,2,2,2,2,2,2,3,3,1,1,1,,2,99,1,2,1,1,1,,,1,1,1,1,,,5,4,5,4,4,5,5,690,15,Guerrero,1,1245,1,1.00000000000000000000,12.08737864077670000000,2012-09-04,12
143,16,HGZMF 1 Pachuca,30,8,12,9,32,9,45,34,2,2,5,1,1,1,2,3,1,5,2,1,2,1,1,2,2,2,2,,,,,2,2,,,1,1,1,1,1,1,4,1,2,1,2,2,1,2,2,2,2,2,2,2,2,2,,,2,,,,,,,,,,2,,,1,2,1,1,2,2,,5,5,5,2,2,,,3,2,2,2,2,3,2,1,,2,1,2,4,2,,,,,,,1,2,2,1,3,3,3,3,3,5,3,719,16,Hidalgo,1,1165,1,1.00000000000000000000,7.28125000000000000000,2012-08-30,13
155,16,HGZMF 1 Pachuca,30,8,12,16,22,16,40,69,2,2,2,1,2,1,2,2,2,5,2,2,1,1,1,2,2,2,2,,,,,2,1,2,1,1,1,1,2,1,2,,,,1,1,1,2,2,2,2,2,2,2,2,2,2,2,2,,,,,,,,,,,2,,,2,1,2,1,2,2,2,,,,2,5,,,2,2,2,2,2,2,2,1,,2,1,2,2,2,,,,,,,1,1,,,3,3,2,2,3,5,5,719,16,Hidalgo,1,1165,1,1.00000000000000000000,7.28125000000000000000,2012-08-30,13
20,16,HGZMF 6 Tepeji del R�o,3,9,12,19,9,19,25,31,2,2,6,1,2,1,2,2,2,5,2,2,2,1,1,1,2,2,2,2,,,,2,1,2,1,1,1,1,1,1,2,,,,1,1,1,2,2,2,2,2,1,2,2,2,2,2,2,,,,,,2,,,,,2,,,2,1,1,1,2,2,2,4,4,4,2,2,,,3,4,3,2,2,3,2,1,,2,2,3,3,1,1,1,,,2,,1,1,,,1,1,1,1,1,1,1,723,16,Hidalgo,1,390,2,0.15186915887850500000,8.82474226804124000000,2012-09-03,13
1,17,UMF 100 Jamay,5,9,12,10,5,10,20,23,2,2,4,1,2,1,4,2,2,5,2,2,1,1,1,1,2,1,1,2,,2,2,2,1,1,1,1,1,1,2,1,2,,,,1,1,1,2,2,2,2,2,1,2,2,2,2,2,2,,,,,,2,,,,,2,,,2,1,1,1,2,2,2,4,4,2,3,3,,,2,4,2,4,4,2,2,1,,2,2,2,2,1,1,1,,,1,1,1,1,,,2,3,4,1,1,4,5,805,17,Jalisco,1,94,4,0.02958766131570660000,44.12500000000000000000,2012-09-05,14
4,19,HGZMF 7 Cuautla,3,9,12,10,25,11,0,23,1,1,7,1,4,1,1,1,2,5,2,2,1,1,1,1,2,1,1,1,,1,1,1,1,1,1,1,1,1,1,1,1,2,1,1,1,1,1,2,2,2,2,2,1,2,2,2,2,1,1,,,,,,1,,,,,2,,,1,1,2,1,2,2,2,,,,2,2,,,2,2,2,2,2,97,,1,,1,1,1,1,1,1,1,,,1,1,1,1,,,1,5,5,3,5,5,5,959,19,Morelos,1,458,3,0.29005699810006300000,10.38815789473680000000,2012-09-03,17
55,19,HGZMF 5 Zacatepec,31,8,12,16,45,17,10,65,2,2,1,1,4,1,1,2,1,5,1,1,1,1,1,1,2,1,2,1,,1,,1,2,,,1,1,1,1,1,2,,,,1,1,1,2,2,2,2,2,1,2,2,2,2,1,1,,,,,,1,,,,,2,,,2,1,2,1,2,2,1,,,,2,2,,,2,2,2,2,2,1,1,1,,2,1,1,1,1,1,1,,,1,1,1,1,,,1,1,1,1,1,3,3,960,19,Morelos,1,467,3,0.29575680810639600000,9.99367088607595000000,2012-08-31,17
60,19,HGZMF 5 Zacatepec,31,8,12,19,45,20,5,68,2,2,9,1,3,1,2,2,2,5,2,1,1,1,1,1,2,1,1,2,,2,2,1,1,1,1,1,1,1,1,1,1,4,1,1,1,1,1,2,2,2,2,2,1,2,2,2,2,1,1,,,,,,2,,,,,2,,,1,1,1,1,2,2,2,2,2,2,2,2,,,3,3,3,3,3,1,1,1,,2,2,1,1,1,1,1,,,1,1,1,1,,,1,1,3,1,1,1,3,960,19,Morelos,1,467,3,0.29575680810639600000,9.99367088607595000000,2012-08-31,17
7,20,UMF 24 Tepic,30,8,12,9,12,9,27,51,2,2,5,1,3,1,2,2,2,5,1,2,1,1,1,1,1,1,2,2,2,2,,1,1,2,1,1,1,2,2,1,2,,,,1,1,1,2,2,2,2,1,1,2,2,2,2,2,2,,,,,2,2,,,,,2,,,1,1,1,1,2,2,2,2,2,2,2,2,,,2,2,2,2,2,2,1,1,,2,2,2,2,1,1,1,,,1,1,1,1,,,1,1,5,1,1,1,1,999,20,Nayarit,1,943,1,1.00000000000000000000,7.72950819672131000000,2012-08-30,18
35,23,UMF 2 Puebla,31,8,12,12,41,13,2,74,2,2,3,1,2,1,2,2,2,5,1,1,1,1,1,1,1,2,2,2,2,,,1,1,3,1,1,1,1,1,1,2,,,,1,2,2,2,2,2,2,2,2,2,2,2,2,,,,,,,,,,,,,2,,,1,1,2,2,2,2,2,,,,,,,,2,2,2,2,3,1,1,1,,2,1,1,3,2,,,,,,,1,1,,,5,5,5,3,5,5,5,1142,23,Puebla,1,1095,1,0.20221606648199400000,18.80208333333330000000,2012-08-31,21
68,23,UMF 6 Puebla,3,9,12,19,40,20,5,46,2,1,7,1,2,1,2,2,2,5,2,1,1,1,1,1,1,1,2,2,2,2,,2,1,2,1,1,2,1,2,1,2,,,,1,1,1,2,2,2,1,2,2,2,2,2,2,2,2,,,,2,,,,,,,2,,,1,1,2,2,2,2,2,,,,,,,,2,2,2,2,2,2,1,1,,2,2,2,2,2,,,,,,,1,1,,,3,4,3,3,5,5,5,1144,23,Puebla,1,1015,1,0.18744228993536500000,21.15234375000000000000,2012-09-03,21
4,23,UMF 9 Santa Mar�a Coap�n,4,9,12,10,5,10,20,26,1,2,9,1,3,1,2,1,2,5,1,2,1,1,1,1,2,2,1,2,,,2,1,1,2,1,1,1,1,2,1,2,,,,1,1,1,2,1,2,2,2,2,2,2,2,2,2,2,,2,,,,,,,,,2,,,1,1,2,1,2,2,2,,,,2,2,,,2,2,2,2,5,97,,1,,2,1,1,2,2,,,,,,,2,,,,5,5,5,1,5,5,5,1146,23,Puebla,1,616,2,0.13917758698599200000,15.80714285714290000000,2012-09-04,21
26,23,UMF 9 Santa Mar�a Coap�n,4,9,12,12,15,12,30,52,2,2,4,1,2,1,1,1,2,5,1,1,1,1,1,1,1,1,1,2,1,2,2,2,1,2,1,1,1,2,1,1,1,1,1,2,1,1,1,2,2,2,2,2,2,2,2,2,2,1,1,,,,,,,,,,,2,,,1,1,1,1,2,2,1,1,1,1,1,1,,,1,1,1,1,1,1,1,1,,2,99,2,1,1,1,1,,,1,1,1,1,,,5,1,3,1,1,1,1,1146,23,Puebla,1,616,2,0.13917758698599200000,15.80714285714290000000,2012-09-04,21
12,26,UMF 47 San Luis Potos�,4,9,12,18,40,19,5,40,2,2,3,1,2,1,2,2,2,5,2,1,2,3,99,1,1,1,1,2,3,2,3,2,2,,,1,1,2,1,2,2,,,,1,1,1,1,2,2,2,1,1,2,2,2,2,2,2,99,,,,2,2,,,,,2,,,1,1,2,2,2,1,2,,,,,,,2,3,2,3,3,3,97,,1,,2,2,2,2,2,,,,,,,99,,,,1,3,5,2,2,4,5,1251,26,San Luis Potos�,1,1500,1,1.00000000000000000000,21.12676056338030000000,2012-09-04,24
26,30,UMF 30 Villa Aldama,30,8,12,15,42,15,54,30,1,2,7,1,2,1,2,2,2,5,2,2,2,1,1,1,1,2,2,1,1,,,2,1,2,2,1,1,1,1,1,2,,,,1,1,1,2,1,2,2,2,1,2,2,2,2,1,1,,1,,,,1,,,,,2,,,2,1,1,1,2,2,4,4,4,4,5,5,,,5,5,5,5,5,2,2,1,,2,2,2,2,1,1,1,,,1,1,1,2,96,,1,1,1,1,1,5,1,1510,30,Tamaulipas,1,42,3,0.03465346534653470000,15.53846153846150000000,2012-08-30,28
6,35,UMF 33 Morelos,30,8,12,11,12,11,28,76,2,2,1,1,1,1,1,1,2,5,2,1,1,1,99,1,1,2,2,2,1,,,1,1,2,1,1,1,1,1,1,2,,,,1,1,2,2,1,2,2,2,2,2,2,2,2,2,,,1,,,,,,,,,2,,,1,1,1,2,2,2,2,1,1,1,,,,,1,4,2,2,1,1,1,1,,2,2,1,1,1,2,1,,,1,2,1,2,2,2,1,1,1,1,1,2,3,1787,35,Zacatecas,1,76,5,0.10810810810810800000,6.16666666666667000000,2012-08-30,32
11,35,UMF 33 Morelos,30,8,12,15,58,16,16,52,2,2,4,1,3,1,1,1,2,5,1,1,2,1,99,1,1,1,1,1,2,2,2,2,1,1,1,1,1,1,1,1,1,2,2,1,1,1,1,1,1,99,99,2,2,2,2,2,2,1,1,1,1,,,,,,,,,2,,,2,1,1,1,2,2,1,2,2,2,1,1,,,2,2,2,1,1,1,1,1,,2,2,1,1,1,2,1,,,1,2,1,2,2,2,1,1,1,1,2,3,3,1787,35,Zacatecas,1,76,5,0.10810810810810800000,6.16666666666667000000,2012-08-30,32
44,2,HGPMF 31 Mexicali,6,9,12,19,32,19,56,27,1,2,8,1,5,1,2,2,2,6,1,1,1,1,1,1,2,1,1,2,,2,2,1,1,2,1,1,1,1,2,1,2,,,,1,1,1,2,2,2,2,2,1,2,2,2,2,2,2,,,,,,2,,,,,2,,,1,1,1,1,2,2,2,2,2,2,2,2,,,2,2,2,2,2,1,1,1,,2,2,1,2,1,1,1,,,1,1,1,1,,,2,2,4,1,2,4,4,26,2,Baja California,1,419,3,0.15535780496848400000,20.43181818181820000000,2012-09-06,2
9,2,UMFH 5 Ejido Nuevo Le�n,10,9,12,12,9,12,25,53,2,2,1,1,2,1,2,2,2,6,1,1,1,1,1,1,2,1,1,2,,2,2,1,2,,,1,2,2,2,1,1,3,1,2,1,1,1,2,2,2,2,2,1,2,2,2,2,2,2,,,,,,2,,,,,2,,,2,1,1,1,2,2,2,2,2,2,2,2,,,2,2,2,2,2,2,2,1,,2,2,99,2,1,1,1,,,1,1,2,,,,2,5,5,2,2,5,5,40,2,Baja California,1,101,4,0.07927786499215070000,21.23333333333330000000,2012-09-10,2
48,3,HGZMF 1 La Paz,29,8,12,12,15,12,35,64,2,2,2,1,3,1,1,1,2,6,1,2,1,1,1,1,1,1,1,2,2,1,2,3,2,,,1,1,1,2,1,1,3,1,1,1,1,1,2,2,2,2,2,2,2,2,2,2,1,1,,,,,,,,,,,2,,,2,1,2,1,2,2,1,,,,1,2,,,1,2,2,99,2,99,99,99,,2,1,2,2,2,,,,,,,2,,,,1,5,99,1,1,4,99,71,3,Baja California Sur,1,728,1,1.00000000000000000000,5.55725190839695000000,2012-08-29,3
50,3,UMF-UMAA 34 La Paz,31,8,12,15,50,16,6,41,2,2,3,1,3,1,2,2,2,6,2,2,1,1,1,2,2,2,2,,,,,2,1,4,1,1,1,2,2,2,1,2,1,2,1,2,1,2,2,2,2,2,1,2,2,2,2,,2,,,,,,2,,,,,2,,,1,1,1,1,2,2,2,2,2,2,2,2,,,2,2,2,2,2,1,1,1,,2,1,1,2,1,1,1,,,1,1,99,,,,4,2,5,2,1,5,5,73,3,Baja California Sur,1,360,2,0.20385050962627400000,8.53140096618357000000,2012-08-31,3
28,3,UMF 6 San Jos� del Cabo,3,9,12,11,21,11,38,66,2,2,2,1,3,1,1,1,2,6,1,99,1,1,1,1,1,1,1,2,1,2,2,1,1,1,1,1,1,1,1,1,2,,,,1,1,1,2,2,2,2,2,1,2,2,2,2,1,1,,,,,,1,,,,,2,,,2,1,2,1,2,2,2,,,,2,2,,,2,2,2,2,2,2,2,1,,2,1,1,2,1,1,1,,,1,1,1,1,,,1,5,5,3,3,5,5,74,3,Baja California Sur,1,437,2,0.24745186862967200000,6.39855072463768000000,2012-09-03,3
17,4,UMF 10 Santa Luc�a,30,8,12,10,12,10,39,39,1,2,5,1,3,1,2,1,2,6,1,2,1,1,1,1,1,1,1,2,2,2,2,1,1,2,1,1,2,1,2,2,1,4,1,5,1,1,2,1,2,2,2,2,2,2,2,2,2,1,,2,,,,,,,,,,2,,,1,1,2,1,2,2,2,,,,1,1,,,2,2,2,2,1,2,1,1,,2,2,1,2,1,1,1,,,1,1,1,1,,,5,5,5,1,1,5,5,96,4,Campeche,1,249,1,0.14318573893042000000,5.79666666666667000000,2012-08-30,4
4,6,UMF 46 Ciudad Ju�rez,29,8,12,9,25,9,46,58,1,2,5,1,2,1,2,2,2,6,2,1,1,1,1,1,1,1,1,2,2,2,2,1,1,2,1,1,1,1,1,1,1,3,2,2,1,1,1,2,2,2,1,2,1,2,2,2,2,2,2,,,,2,,2,,,,,2,,,1,1,2,1,1,2,2,,,,2,2,2,,2,2,2,2,2,97,,1,,2,2,1,1,1,1,1,,,1,1,1,1,,,1,1,4,1,1,5,4,154,6,Chihuahua,1,886,1,0.15127198224346900000,37.54487179487180000000,2012-08-29,8
2,7,HGZMF 7 Monclova,6,9,12,8,29,8,52,20,1,2,5,1,2,1,2,2,2,6,2,2,1,1,1,1,1,1,1,2,2,2,2,1,2,,,1,1,1,2,1,2,,,,1,1,1,2,2,2,2,2,2,2,2,2,2,3,2,,,,,,,,,,,2,,,2,1,2,2,2,2,2,,,,,,,,3,2,3,2,2,97,,1,,2,2,2,2,2,,,,,,,2,,,,1,1,5,1,1,5,5,237,7,Coahuila,1,761,2,0.12150726488903100000,24.08846153846150000000,2012-09-06,5
31,8,UMF 2 Manzanillo,4,9,12,11,58,12,23,58,2,2,5,1,3,1,4,2,2,6,99,99,1,1,1,2,1,2,2,,2,,,1,1,1,1,1,2,1,2,2,1,2,2,2,1,1,1,2,2,2,2,2,1,2,2,2,2,3,2,,,,,,2,,,,,2,,,99,1,2,1,1,2,2,,,,2,2,2,,2,2,2,99,99,99,99,1,,2,2,99,2,2,,,,,,,1,1,,,3,1,5,2,5,5,5,320,8,Colima,1,341,1,0.18944444444444400000,5.45454545454546000000,2012-09-04,6
10,11,UMFH 13 Tlahuallilo,3,9,12,13,34,13,56,38,1,2,6,1,2,1,2,2,2,6,2,2,1,1,1,1,2,2,2,1,,,,1,1,1,1,1,1,1,1,1,2,,,,1,1,1,2,2,2,2,2,2,2,2,2,2,2,2,,,,,,,,,,,2,,,1,1,2,1,99,99,2,,,,4,4,,,2,2,2,2,2,2,1,1,,2,2,1,1,1,1,1,,,1,1,1,1,,,1,1,1,1,2,2,2,450,11,Durango,1,97,4,0.07467282525019250000,10.82500000000000000000,2012-09-03,10
3,11,UMF 32 El Vergel,3,9,12,9,40,9,59,40,1,1,3,1,2,1,2,2,2,6,2,2,2,1,1,1,2,2,2,99,,,,3,1,2,1,1,1,1,1,1,2,,,,1,1,1,2,1,2,2,2,2,2,2,2,2,2,2,,4,,,,,,,,,2,,,2,1,1,2,2,2,3,2,2,2,,,,,3,3,3,3,3,3,2,1,,2,1,2,2,2,,,,,,,2,,,,1,5,5,2,1,5,5,453,11,Durango,1,70,4,0.05388760585065440000,10.47580645161290000000,2012-09-03,10
9,11,UMF 32 El Vergel,3,9,12,12,40,12,59,21,1,2,5,1,2,1,4,4,2,6,3,2,1,2,2,2,2,2,2,,,,,3,1,4,1,1,2,1,2,2,2,,,,1,2,1,2,1,2,2,2,2,2,2,2,2,,3,,3,,,,,,,,,2,,,2,1,2,2,2,2,3,,,,,,,,3,3,3,3,3,97,,1,,2,1,2,3,2,,,,,,,2,,,,1,1,5,2,5,5,5,453,11,Durango,1,70,4,0.05388760585065440000,10.47580645161290000000,2012-09-03,10
2,11,UMF-UMAA 53 G�mez Palacio,31,8,12,8,46,9,2,22,1,2,7,1,4,1,3,2,2,6,1,1,1,1,1,1,2,1,1,2,,2,2,2,1,2,1,1,1,1,2,2,2,,,,1,1,1,2,1,2,2,2,1,2,1,2,2,2,2,,2,,,,3,,1,,,2,,,2,1,1,1,2,2,2,2,2,2,2,2,,,2,1,2,2,1,2,1,1,,2,99,2,2,1,2,1,,,1,1,2,,,,1,2,3,2,4,3,4,1951,11,Durango,1,525,3,0.18830703012912500000,14.29743589743590000000,2012-08-31,10
20,11,UMF-UMAA 53 G�mez Palacio,31,8,12,8,24,8,40,52,2,2,3,1,3,1,2,2,1,6,1,1,1,1,1,1,2,1,2,2,,2,,1,1,2,1,1,1,1,1,2,2,,,,1,1,1,2,2,2,2,2,1,1,1,2,2,2,2,,,,,,2,2,2,,,2,,,1,1,1,1,2,2,2,2,2,3,2,2,,,2,2,2,2,2,2,99,1,,2,1,2,2,1,1,1,,,1,1,1,1,,,3,2,4,2,2,5,5,1951,11,Durango,1,525,3,0.18830703012912500000,14.29743589743590000000,2012-08-31,10
29,12,UMF 84 Chimalhuac�n,10,9,12,12,3,12,21,54,2,2,3,1,2,1,2,2,2,6,97,99,1,1,1,1,1,1,1,2,2,2,2,2,1,2,1,1,1,1,1,1,1,3,1,2,1,1,1,2,2,2,2,2,1,2,2,2,2,2,2,,,,,,2,,,,,2,,,2,1,2,1,2,2,2,,,,2,2,,,2,2,2,99,99,1,99,1,,2,2,2,2,1,1,1,,,1,1,1,1,,,2,5,99,1,99,5,99,523,12,M�xico Oriente,1,623,2,0.07058690233401310000,62.59574468085110000000,2012-09-10,15
13,13,UMF 249 Santiago Tlaxomulco,3,9,12,9,15,9,37,19,2,1,7,1,2,1,2,2,2,6,1,2,1,1,1,1,1,1,2,2,2,2,,3,1,2,1,1,1,2,2,2,1,1,1,2,1,1,1,2,2,2,2,2,1,2,2,2,2,2,2,,,,,,4,,,,,2,,,1,1,2,1,2,2,2,,,,2,2,,,2,2,4,2,4,97,,1,,2,1,3,2,1,1,1,,,1,1,2,,,,3,3,3,1,3,3,3,1959,13,M�xico Poniente,1,415,2,0.09429675073846850000,28.95394736842110000000,2012-09-03,15
14,14,HGZMF 21 Le�n,5,9,12,9,50,10,5,34,2,2,7,1,4,1,2,2,2,6,97,1,1,1,1,1,1,1,1,1,1,1,1,1,1,2,1,1,1,1,1,1,2,,,,1,2,1,2,1,2,2,2,1,2,2,2,2,,1,,1,,,,2,,,,,2,,,2,1,2,1,2,2,1,,,,2,2,,,1,1,1,1,1,97,,1,,2,2,97,2,1,1,1,,,2,,2,,,,1,2,2,1,1,1,1,626,14,Guanajuato,1,1339,1,0.16045536249251000000,32.09615384615380000000,2012-09-05,11
6,14,UMF 50 Guanajuato,3,9,12,10,40,11,0,50,1,1,3,1,3,1,1,1,1,6,2,2,1,1,2,1,2,2,2,5,,,,1,2,,,1,2,1,2,2,1,4,1,1,1,1,1,2,2,2,2,2,1,2,2,2,2,2,2,,,,,,1,,,,,2,,,2,1,1,1,2,2,2,1,1,5,2,2,,,2,2,2,3,2,2,2,1,,2,2,1,2,1,1,1,,,1,1,1,99,,,1,1,3,1,1,3,3,632,14,Guanajuato,1,302,2,0.08708189158016150000,29.89655172413790000000,2012-09-03,11
21,14,HGSMF 13 Ac�mbaro,3,9,12,16,10,16,30,72,2,2,3,1,3,1,2,1,2,6,2,1,1,1,1,1,1,1,1,2,2,2,1,1,2,,,1,2,1,1,1,2,,,,1,1,1,2,2,2,2,2,2,2,2,2,2,1,1,,,,,,,,,,,2,,,1,1,2,1,2,2,2,,,,2,2,,,2,2,2,2,2,2,2,1,,2,1,1,1,1,1,1,,,1,1,1,1,,,2,2,3,2,1,2,3,635,14,Guanajuato,1,217,2,0.06257208765859280000,30.96428571428570000000,2012-09-03,11
30,14,HGSMF 13 Ac�mbaro,3,9,12,18,40,18,59,25,1,2,5,1,2,1,2,2,2,6,2,2,1,1,1,1,1,1,2,2,2,2,,1,1,2,1,1,1,1,2,1,2,,,,1,1,1,2,1,2,2,2,1,2,2,2,2,2,2,,1,,,,2,,,,,2,,,2,1,2,1,2,2,2,,,,2,2,,,3,2,2,2,2,2,2,1,,2,2,2,2,1,1,1,,,1,1,1,1,,,2,2,4,1,2,5,4,635,14,Guanajuato,1,217,2,0.06257208765859280000,30.96428571428570000000,2012-09-03,11
10,15,UMF 28 El Coloso,3,9,12,12,20,12,41,82,2,2,3,1,1,1,2,2,2,6,1,1,1,1,1,1,1,1,1,2,2,2,2,1,2,,,1,1,1,1,1,2,,,,1,1,1,2,2,2,2,2,1,2,1,1,1,2,2,,,,,,2,,99,99,2,2,,,2,1,2,1,2,2,2,,,,1,1,,,2,2,2,2,2,97,,1,,1,1,1,1,1,1,1,,,1,1,1,1,,,2,2,2,1,2,2,5,698,15,Guerrero,1,225,4,0.24779735682819400000,11.35000000000000000000,2012-09-03,12
4,16,HGZMF 1 Pachuca,30,8,12,11,10,11,19,40,1,1,5,1,3,1,2,2,2,6,1,1,1,1,2,1,1,1,1,2,2,2,2,1,2,,,1,1,2,2,1,2,,,,1,1,1,2,2,2,2,2,1,2,2,2,2,2,2,,,,,,2,,,,,2,,,2,1,1,1,2,2,2,2,2,2,2,2,,,3,2,2,2,2,1,1,1,,2,99,99,2,1,1,1,,,1,1,2,,,,1,5,5,2,4,3,5,719,16,Hidalgo,1,1165,1,1.00000000000000000000,7.28125000000000000000,2012-08-30,13
35,17,UMF 34 Guadalajara,31,8,12,14,13,14,23,69,2,4,1,1,99,1,1,1,2,6,1,1,1,1,1,1,2,1,1,1,,1,1,1,1,1,1,1,1,1,1,1,2,,,,1,1,1,2,2,2,2,2,2,2,2,2,2,1,1,,,,,,,,,,,2,,,2,1,2,1,2,2,1,,,,1,1,,,2,4,1,1,1,1,1,1,,2,1,1,1,2,,,,,,,2,,,,1,2,5,1,1,3,5,750,17,Jalisco,1,1556,1,0.11174147217235200000,49.37943262411350000000,2012-08-31,14