Folio,Deleg,Unidmed,Id_Unid,Fecha_D,Fecha_M,Fecha_A,Hr_Ini_H,Hr_Ini_M,Hr_Fin_H,Hr_Fin_M,Edad,Sexo,Escolar,Ocupa,Ingreso,Secc1,Sat1,Sat3,Motcons2,Probsal,Probsal_G,Tiem_Esp2,Tprevio,Tprevio_H,Tprevio_M,Gastras,Tmedico,Tmedico_H,Tmedico_M,Tmedreg,Tmedreg_H,Tmedreg_M,Filtroch,Btratou,Preosad,Expclaa_A,Expclaa_B,Expclaa_C,Expclaa_D,Expclab_A,Expclab_B,Expclab_C,Expclab_D,Mopin,Explora,Prevenf_A,Prevenf_B,Prevenf_C,Prevenf_D,Preven1,Preven2,Preven3,Preven4,Filtrourg,Probsal_Urg,Mot_Urg,Motnoatn,Calteurg,Mottesp,Tespurg,Servurg,Tobscama,Expurg,Clarurg,Califurg,Filtrocir,Progciru,Topera,Fechaop,Suspop3,Suspop1,Suspop4,Motoper1,Calciru,Filtrohos,Nochesh,Frecrevm,Asisenf,Infamho,Calhosp,Filtrosaux,Saduni,Gastoest,Temsad,Satlarx,Secc2,Calfatna_A,Calfatna_B,Calfatna_C,Calfatna_D,Calfatna_E,Calfatna_F,Calfatna_G,Calfatna_H,Calfatna_I,Calfatna_J,Calfatna_K,Calfatna_L,Calfatna_M,Calfatna_N,Calfatnb_A,Calfatnb_B,Calfatnb_C,Calfatnb_D,Calfatnb_E,Calfatnb_F,Calfatnb_G,Calfatnb_H,Calfatnb_I,Calfatnb_J,Calfatnb_K,Calfatnb_L,Calfatnb_M,Calfatnb_N,Calfinma_A,Calfinma_B,Calfinma_C,Calfinma_D,Calfinma_E,Calfinmb_A1,Calfinmb_B1,Calfinmb_B2,Calfinmb_B3,Calfinmb_C1,Calfinmb_C2,Calfinmb_D1,Calfinmb_E1,Calfinmb_F,Calfinmb_G,Calfinmb_H,Calfinmb_J,Rgcalinm,Filtrofarm,Tfarsurt,Tfarsurt_H,Tfarsurt_M,Totmed,Acnomed,Farm1,Farm2,Farm5,Farm6,Satmed,Resurt1,Resurt2,Resurt3,Atn1fam,Sat2,Motinsat,Opelec_B,Opelec_C,Prefeserv,Filtroaten,Otroserv,Mot_Otro,Probsal2,Probsal2_G,Trat_Otro,Tmp_Otro,Sat_Otro,Neg_Cons1,Motneg,Neg_Cons2,Neg_Cons3,Recomej_A,Recomej_B,Recomej_C,Id_Unidad,Cve_Delegaci�N,Delegaci�N,Nivel,Unidad,Promedio_Diario2013,Estrato,Moscondia,Fe_Finalnr,Fecha,Entidad
9672,1,HGZ 1 Aguascalientes,11,25,2,14,9,51,10,12,36,2,5,3,2,1,2,2,4,1,1,5,2,1,0,0,1,0,15,1,0,15,1,2,1,1,1,1,1,2,2,2,2,1,1,1,1,1,1,2,,1,7,2,,,,,,,,,,,,2,,,,,,,,,2,,,,,,1,1,,2,2,,1,2,1,2,2,2,2,2,2,2,2,2,2,2,1,,1,,,,,,,,,,,,1,1,1,2,2,1,2,2,2,1,2,,,2,1,1,2,2,2,,,,,,2,,,,2,2,,,1,2,,2,2,6,1,2,9,998,998,2,1,2,2,,2,,2,4,,11,1,Aguascalientes,2,HGZ 1 Aguascalientes,888,1,1.00000000000000000000,8.92449988462098000000,2014-02-25,1
9679,1,HGZ 1 Aguascalientes,11,25,2,14,13,1,13,20,39,2,7,3,3,,2,2,6,1,1,3,5,10,0,0,3,1,15,2,0,45,1,2,1,1,1,1,1,1,1,1,1,2,1,2,2,1,2,1,3,2,,2,,,,,,,,,,,,2,,,,,,,,,2,,,,,,1,1,,3,2,2,1,1,1,2,2,1,2,2,2,2,1,2,2,2,1,2,2,,,2,,,,,2,,,,1,2,1,2,2,1,,,,1,1,,,1,1,2,2,3,1,1,0,5,1,,1,3,2,,2,2,,,1,2,,2,2,5,2,,,,,,,,2,,99,,10,3,,11,1,Aguascalientes,2,HGZ 1 Aguascalientes,888,1,1.00000000000000000000,8.92449988462098000000,2014-02-25,1
9727,1,HGZ 1 Aguascalientes,11,25,2,14,19,27,19,50,70,2,2,10,3,1,1,1,6,11,11,2,1,0,30,0,1,0,15,1,0,15,1,1,1,1,97,97,1,1,,,1,1,1,1,2,1,1,1,1,1,3,2,,,,,,,,,,,,2,,,,,,,,,2,,,,,,2,,,,,,2,1,1,2,1,2,2,2,2,2,2,2,1,2,,4,1,,1,,,,,,,,4,,1,1,1,2,2,1,1,1,4,1,1,,,3,3,2,3,3,2,,,,,,1,1,,,3,2,,,1,3,,1,99,5,1,5,8,1,1,1,3,3,2,,1,5,5,14,1,11,1,Aguascalientes,2,HGZ 1 Aguascalientes,888,1,1.00000000000000000000,6.89025931301020000000,2014-02-25,1
9744,1,HGZ 1 Aguascalientes,11,25,2,14,9,39,9,57,55,2,2,2,3,,2,2,4,3,3,2,2,0,45,0,1,0,15,1,0,15,1,2,1,1,1,1,1,2,2,2,2,1,1,1,1,1,2,2,,1,2,2,,,,,,,,,,,,2,,,,,,,,,2,,,,,,1,1,,2,99,2,1,2,2,2,2,2,2,1,2,2,2,2,2,2,2,,,,,,,2,,,,,,,1,1,1,2,1,2,4,4,4,2,2,,2,2,2,2,2,4,2,,,,,,2,,,,2,2,,,2,2,,2,2,6,2,,,,,,,,3,,2,,2,7,,11,1,Aguascalientes,2,HGZ 1 Aguascalientes,888,1,1.00000000000000000000,8.18858722017432000000,2014-02-25,1
9750,1,HGZ 1 Aguascalientes,11,25,2,14,15,0,15,23,41,2,5,4,4,,2,3,3,1,1,2,3,1,25,0,3,1,30,2,1,0,2,,,,,,,,,,,,,,,,,2,,2,,1,1,2,,3,,3,4,,1,1,2,2,,,,,,,,,2,,,,,,2,,,,,2,1,2,1,2,2,2,2,2,2,2,2,2,2,2,2,,2,,,,,,,,,,,,1,1,1,1,1,2,2,1,2,3,3,2,2,3,2,1,99,4,2,,,,,,1,1,,,2,2,,,1,2,,2,2,6,2,,,,,,,,2,,2,,7,,,11,1,Aguascalientes,2,HGZ 1 Aguascalientes,888,1,1.00000000000000000000,8.92449988462098000000,2014-02-25,1
9756,1,HGZ 1 Aguascalientes,11,25,2,14,13,1,13,18,57,2,2,5,2,1,2,2,5,1,1,3,1,0,10,0,3,2,0,2,1,0,2,,,,,,,,,,,,,,,,,1,1,1,1,2,,,,,,,,,,,,2,,,,,,,,,2,,,,,,1,1,,3,99,,1,2,1,2,2,2,2,1,2,2,2,2,2,1,2,,2,,,,,2,,,,,,2,1,1,1,2,1,2,2,2,2,2,2,,2,2,2,2,2,2,1,1,0,10,1,,1,1,,,2,2,,,2,2,,2,2,6,2,,,,,,,,2,,2,,2,8,13,11,1,Aguascalientes,2,HGZ 1 Aguascalientes,888,1,1.00000000000000000000,8.18858722017432000000,2014-02-25,1
9668,1,HGZ 1 Aguascalientes,11,25,2,14,9,52,10,14,72,2,3,5,3,1,2,2,3,3,3,3,1,0,30,6,2,0,40,2,0,40,1,2,1,1,2,2,2,2,,,,1,1,1,1,2,2,2,,2,,2,,,,,,,,,,,,2,,,,,,,,,2,,,,,,2,,,,,,2,1,1,2,1,1,2,2,2,2,2,2,2,1,,2,2,,2,2,,,,,,,,2,1,2,1,2,2,2,,,,2,3,,,2,2,2,2,3,1,1,0,2,1,,2,,,,2,2,,,1,2,,2,2,6,2,,,,,,,,2,,2,,2,7,11,11,1,Aguascalientes,2,HGZ 1 Aguascalientes,888,1,1.00000000000000000000,6.89025931301020000000,2014-02-25,1
9671,1,HGZ 1 Aguascalientes,11,25,2,14,9,24,9,47,45,2,5,5,3,,2,2,3,1,1,3,2,0,40,6,2,0,40,2,1,0,2,,,,,,,,,,,,,,,,,1,4,1,1,2,,,,,,,,,,,,2,,,,,,,,,2,,,,,,1,1,,1,2,2,2,1,1,2,2,2,2,2,2,2,2,2,2,2,,2,2,,,,,,,,,,,,1,1,1,2,2,1,3,2,3,2,2,,,3,2,2,3,4,2,,,,,,1,2,1,1000,4,2,,,1,3,,2,2,6,2,,,,,,,,2,,2,,3,2,,11,1,Aguascalientes,2,HGZ 1 Aguascalientes,888,1,1.00000000000000000000,10.75932348232790000000,2014-02-25,1
9685,1,HGZ 1 Aguascalientes,11,25,2,14,17,40,18,2,35,1,6,6,99,,2,2,4,1,1,2,1,0,30,6,1,0,30,1,0,30,1,2,1,1,2,1,2,2,,2,,1,1,1,1,1,1,1,3,2,,2,,,,,,,,,,,,2,,,,,,,,,2,,,,,,2,,,,,2,2,2,1,2,2,2,2,2,2,2,2,2,2,1,,,2,,,,,,,,,,,2,1,2,1,2,2,2,,,,2,2,,,3,2,2,2,3,1,1,0,5,1,,2,,,,2,2,,,99,2,,2,2,6,2,,,,,,,,2,,2,,16,,,11,1,Aguascalientes,2,HGZ 1 Aguascalientes,888,1,1.00000000000000000000,6.99354340850378000000,2014-02-25,1
9690,1,HGZ 1 Aguascalientes,11,25,2,14,17,11,17,32,37,1,5,6,99,,2,2,4,1,1,2,1,0,5,6,3,1,15,2,1,0,1,2,2,1,2,2,2,2,,,,2,1,1,1,2,2,2,,2,,2,,,,,,,,,,,,2,,,,,,,,,2,,,,,,2,,,,,2,2,2,1,2,2,2,2,2,2,2,2,2,2,1,,,1,,,,,,,,,,,2,1,2,1,2,2,2,,,,3,2,,,2,2,2,2,2,1,1,0,5,1,,2,,,,2,2,,,2,2,,2,2,6,2,,,,,,,,2,,2,,2,7,,11,1,Aguascalientes,2,HGZ 1 Aguascalientes,888,1,1.00000000000000000000,6.99354340850378000000,2014-02-25,1
9693,1,HGZ 1 Aguascalientes,11,25,2,14,11,25,11,48,67,2,1,9,99,,3,3,3,16,16,3,1,0,30,6,3,1,30,3,1,30,1,2,1,1,1,1,1,2,2,2,2,2,2,1,2,1,2,2,,1,7,2,,,,,,,,,,,,2,,,,,,,,,2,,,,,,1,1,,4,2,2,2,2,1,2,1,1,1,2,2,2,2,1,2,2,,,2,,2,2,2,,,,,3,,,1,2,1,1,2,1,,,,3,3,3,,3,2,2,2,3,2,,,,,,1,1,,,3,2,,,1,3,,2,2,6,2,,,,,,,,2,,2,,2,7,,11,1,Aguascalientes,2,HGZ 1 Aguascalientes,888,1,1.00000000000000000000,6.89025931301020000000,2014-02-25,1
9716,1,HGZ 1 Aguascalientes,11,25,2,14,13,58,14,20,60,1,2,6,99,,2,2,3,1,1,2,1,0,30,6,1,0,10,1,0,20,2,,,,,,,,,,,,,,,,,1,1,1,7,2,,,,,,,,,,,,2,,,,,,,,,2,,,,,,1,1,,3,2,2,2,2,1,2,2,2,2,1,2,2,2,2,2,1,,,1,,,,,1,,,,,,1,1,1,2,2,2,1,3,2,2,,,,,1,1,1,99,3,2,,,,,,1,1,,,1,2,,,1,2,,2,2,6,2,,,,,,,,2,,2,,1,2,7,11,1,Aguascalientes,2,HGZ 1 Aguascalientes,888,1,1.00000000000000000000,6.41685706974946000000,2014-02-25,1
9732,1,HGZ 1 Aguascalientes,11,25,2,14,8,10,8,35,40,1,5,6,3,1,2,2,12,1,1,6,3,1,30,6,3,1,30,2,1,0,1,2,1,1,1,1,1,2,2,2,2,1,1,1,1,2,2,1,3,1,7,2,,,,,,,,,,,,2,,,,,,,,,2,,,,,,2,,,,,,1,2,1,2,2,2,2,2,2,2,2,2,2,1,2,,2,,,,,,,,,,,3,2,2,2,2,2,,,,,,,,,2,2,2,2,2,2,,,,,,1,2,2,,4,2,,,1,2,,2,2,6,2,,,,,,,,2,,2,,2,3,,11,1,Aguascalientes,2,HGZ 1 Aguascalientes,888,1,1.00000000000000000000,6.99354340850378000000,2014-02-25,1
9736,1,HGZ 1 Aguascalientes,11,25,2,14,15,0,15,23,49,2,5,5,3,,2,2,2,3,3,2,1,0,15,6,1,0,30,3,2,0,1,2,1,1,1,1,1,2,2,2,2,1,2,1,1,2,2,2,,2,,2,,,,,,,,,,,,2,,,,,,,,,2,,,,,,1,1,,1,3,2,1,2,1,2,2,2,2,2,2,2,2,2,2,1,2,,1,,,,,,,,,,,2,1,1,1,2,2,2,4,3,3,3,2,,,2,2,2,2,3,1,1,0,10,1,,1,1,,,2,2,,,1,2,,2,2,4,2,,,,,,,,2,,2,,2,7,,11,1,Aguascalientes,2,HGZ 1 Aguascalientes,888,1,1.00000000000000000000,10.75932348232790000000,2014-02-25,1
9662,1,HGZ 1 Aguascalientes,11,25,2,14,11,52,12,14,47,1,9,6,3,1,2,2,5,999,999,3,1,0,20,12,1,0,10,1,0,10,1,2,2,1,2,2,2,2,,,,2,1,2,2,2,2,1,3,1,7,2,,,,,,,,,,,,2,,,,,,,,,2,,,,,,1,1,,2,2,,1,2,1,2,2,2,2,2,2,2,2,2,2,2,1,,1,,,,,,,,,,,,1,2,1,2,1,3,,,,3,2,,3,3,3,3,3,4,2,,,,,,2,,,,2,2,,,1,2,,2,1,5,1,4,1,4,4,2,2,2,1,2,2,,1,3,4,11,1,Aguascalientes,2,HGZ 1 Aguascalientes,888,1,1.00000000000000000000,8.43137394729093000000,2014-02-25,1
9666,1,HGZ 1 Aguascalientes,11,25,2,14,16,8,16,25,53,2,3,5,3,1,1,1,2,3,3,1,2,1,0,12,1,0,12,2,1,0,2,,,,,,,,,,,,,,,,,2,,2,,1,3,5,,1,,4,7,,1,1,2,2,,,,,,,,,2,,,,,,1,1,,7,2,,1,2,1,2,2,2,2,2,2,2,2,2,2,2,1,,1,,,,,,,,,,,,1,2,1,2,1,2,,,,3,3,,2,3,2,2,2,3,1,1,0,5,1,,2,,,,2,2,,,2,2,,2,2,6,2,,,,,,,,2,,2,,1,2,7,11,1,Aguascalientes,2,HGZ 1 Aguascalientes,888,1,1.00000000000000000000,10.75932348232790000000,2014-02-25,1
9669,1,HGZ 1 Aguascalientes,11,25,2,14,8,31,8,52,46,1,6,2,3,,3,4,4,4,4,3,1,0,15,12,5,3,30,2,0,40,1,1,1,1,1,1,1,1,1,1,1,1,1,1,1,1,1,2,,2,,1,15,2,,3,,4,4,,2,,,2,,,,,,,,,2,,,,,,1,1,,2,1,2,2,2,1,2,1,2,2,2,2,2,2,2,2,2,,,1,,1,,,,,,,,,,1,1,1,2,2,1,1,1,1,1,1,,,1,5,1,99,1,1,1,0,4,1,,1,1,,,1,2,,,99,2,,2,2,6,2,,,,,,,,2,,2,,14,9,3,11,1,Aguascalientes,2,HGZ 1 Aguascalientes,888,1,1.00000000000000000000,8.43137394729093000000,2014-02-25,1
9670,1,HGZ 1 Aguascalientes,11,25,2,14,9,0,9,20,54,1,7,3,3,1,2,2,4,1,1,4,1,0,15,12,2,1,0,2,1,0,1,2,2,1,1,1,1,1,2,1,1,1,1,1,1,1,2,1,3,2,,2,,,,,,,,,,,,2,,,,,,,,,2,,,,,,2,,,,,,1,2,1,2,2,2,2,2,2,2,2,2,2,1,2,,2,,,,,,,,,,,2,1,1,1,2,2,2,3,2,2,2,2,,,2,2,2,2,3,1,1,0,8,1,,1,1,,,2,2,,,2,2,,2,1,2,2,,,,,,,,1,3,2,,3,1,8,11,1,Aguascalientes,2,HGZ 1 Aguascalientes,888,1,1.00000000000000000000,8.43137394729093000000,2014-02-25,1
9673,1,HGZ 1 Aguascalientes,11,25,2,14,10,16,10,38,64,1,3,6,2,,4,3,4,1,1,1,1,0,30,12,2,0,45,2,1,0,2,,,,,,,,,,,,,,,,,1,3,2,,2,,,,,,,,,,,,2,,,,,,,,,2,,,,,,1,1,,4,3,2,1,2,1,2,2,1,1,2,2,2,2,2,2,1,2,,2,,,2,2,,,,,,,2,1,2,1,1,2,3,,,,2,2,2,,3,2,2,99,99,1,1,0,10,1,,1,1,,,2,2,,,1,3,,2,2,6,2,,,,,,,,2,,1,999,1,8,,11,1,Aguascalientes,2,HGZ 1 Aguascalientes,888,1,1.00000000000000000000,6.41685706974946000000,2014-02-25,1
9674,1,HGZ 1 Aguascalientes,11,25,2,14,10,47,11,8,62,2,2,6,3,1,1,1,4,1,1,1,1,0,30,12,2,1,0,2,1,0,2,,,,,,,,,,,,,,,,,2,,2,,2,,,,,,,,,,,,2,,,,,,,,,2,,,,,,2,,,,,,2,2,1,2,2,1,2,2,2,2,2,2,2,1,,,1,,,1,,,,,,,,2,1,2,1,2,2,1,,,,1,1,,,1,1,1,99,2,1,1,0,0,99,,1,1,,,1,2,,,99,1,,2,2,6,2,,,,,,,,2,,2,,16,,,11,1,Aguascalientes,2,HGZ 1 Aguascalientes,888,1,1.00000000000000000000,8.18858722017432000000,2014-02-25,1
9676,1,HGZ 1 Aguascalientes,11,25,2,14,11,39,12,0,42,1,5,2,4,1,3,3,3,1,1,3,2,1,0,12,2,1,0,3,1,30,1,2,1,97,1,97,1,,1,,1,1,1,2,2,2,2,1,4,2,,1,1,2,,2,,1,2,,1,1,2,2,,,,,,,,,2,,,,,,1,1,,4,2,,2,2,1,2,2,2,2,2,2,2,2,2,2,1,,,3,,,,,,,,,,,2,1,1,1,2,2,3,4,4,2,3,2,,,3,2,2,2,4,2,,,,,,1,1,,,2,1,6,4,1,3,,2,2,3,1,3,6,8,8,2,3,2,2,,2,,1,6,,11,1,Aguascalientes,2,HGZ 1 Aguascalientes,888,1,1.00000000000000000000,6.99354340850378000000,2014-02-25,1
9677,1,HGZ 1 Aguascalientes,11,25,2,14,12,6,12,25,48,2,9,2,4,,1,3,3,1,1,5,1,0,20,12,1,0,10,1,0,10,1,4,1,1,1,1,1,1,1,1,1,2,2,1,1,1,1,1,3,2,,2,,,,,,,,,,,,2,,,,,,,,,2,,,,,,2,,,,,2,1,2,1,2,2,2,2,2,2,2,2,2,2,1,1,,1,,,,,,,,,,,1,1,2,1,2,2,2,,,,1,2,,,1,1,1,1,3,1,1,0,3,1,,2,,,,1,2,,,1,1,,1,1,5,2,,,,,,,,1,999,2,,4,6,1,11,1,Aguascalientes,2,HGZ 1 Aguascalientes,888,1,1.00000000000000000000,10.75932348232790000000,2014-02-25,1
9683,1,HGZ 1 Aguascalientes,11,25,2,14,12,21,12,43,27,1,7,6,3,,2,2,12,4,4,1,3,1,30,12,3,2,0,1,0,30,2,,,,,,,,,,,,,,,,,1,3,2,,1,4,2,,2,,2,5,,97,,,2,,,,,,,,,2,,,,,,2,,,,,2,1,2,1,2,2,2,1,2,2,2,2,2,2,2,2,,1,,,,1,,,,,,,,1,1,1,1,2,1,1,1,1,1,1,2,,1,1,1,1,1,2,,,,,,1,1,,,1,2,,,2,1,,2,2,6,2,,,,,,,,2,,2,,16,,,11,1,Aguascalientes,2,HGZ 1 Aguascalientes,888,1,1.00000000000000000000,6.55204610848497000000,2014-02-25,1
9688,1,HGZ 1 Aguascalientes,11,25,2,14,16,37,16,59,41,1,6,6,99,1,2,2,3,1,1,3,2,0,45,12,1,0,30,1,0,30,1,2,1,1,1,1,1,2,1,1,1,1,1,1,1,2,2,2,,2,,2,,,,,,,,,,,,2,,,,,,,,,2,,,,,,2,,,,,,1,1,1,2,2,2,2,2,2,2,2,2,2,1,2,2,2,,,,,,,,,,,2,1,2,1,2,2,2,,,,2,2,,,3,2,2,2,3,1,1,0,15,1,,2,,,,2,2,,,99,2,,2,2,6,2,,,,,,,,2,,2,,7,,,11,1,Aguascalientes,2,HGZ 1 Aguascalientes,888,1,1.00000000000000000000,6.99354340850378000000,2014-02-25,1
9691,1,HGZ 1 Aguascalientes,11,25,2,14,18,24,18,34,66,2,2,6,3,1,1,1,3,1,1,3,3,2,0,12,1,0,10,1,0,5,2,,,,,,,,,,,,,,,,,2,,2,,2,,,,,,,,,,,,2,,,,,,,,,2,,,,,,1,1,,1,1,,1,1,1,2,2,1,1,1,2,2,1,1,1,1,1,1,1,,,1,1,1,,,1,3,1,1,2,1,1,1,1,,1,1,1,1,1,1,1,1,1,1,1,3,2,,,,,,1,1,,,1,2,,,1,2,,2,2,3,2,,,,,,,,2,,2,,2,4,9,11,1,Aguascalientes,2,HGZ 1 Aguascalientes,888,1,1.00000000000000000000,6.89025931301020000000,2014-02-25,1
9694,1,HGZ 1 Aguascalientes,11,25,2,14,12,30,12,48,35,1,5,6,3,1,2,1,4,10,10,4,1,0,30,12,1,0,5,1,0,5,1,2,1,1,2,1,1,2,,1,1,2,2,1,1,1,2,1,3,1,5,1,3,5,,3,,1,5,,1,1,2,2,,,,,,,,,2,,,,,,1,1,,1,2,,2,2,1,2,1,2,2,2,2,2,2,2,2,1,,,2,,2,,,,,,,,,2,1,2,1,2,2,2,,,,3,3,,,1,1,1,1,3,1,1,0,5,1,,1,1,,,2,2,,,99,2,,2,2,6,2,,,,,,,,1,2,1,3,4,14,2,11,1,Aguascalientes,2,HGZ 1 Aguascalientes,888,1,1.00000000000000000000,6.99354340850378000000,2014-02-25,1
9696,1,HGZ 1 Aguascalientes,11,25,2,14,14,28,14,35,72,2,5,10,2,1,1,1,4,14,14,4,2,1,0,12,1,0,20,4,3,0,1,2,2,1,1,1,1,2,2,1,1,4,2,2,2,2,2,1,3,1,5,2,,,,,,,,,,,,1,2,4,2,5,2,60,998,1,1,1,1,3,1,1,2,,,,,,1,2,1,2,2,2,2,2,2,2,2,2,2,1,1,,1,,,,,,,,,,,1,1,1,1,1,1,1,1,2,4,1,1,1,1,1,1,1,1,2,1,2,0,20,1,,1,1,,,2,2,,,99,2,,2,2,6,2,,,,,,,,2,,2,,3,2,14,11,1,Aguascalientes,2,HGZ 1 Aguascalientes,888,1,1.00000000000000000000,6.89025931301020000000,2014-02-25,1
9698,1,HGZ 1 Aguascalientes,11,25,2,14,16,45,16,59,57,2,3,11,3,1,1,1,4,1,1,2,1,0,15,12,1,0,20,1,0,20,1,2,1,1,1,1,1,1,1,1,1,1,1,1,1,1,2,1,3,2,,2,,,,,,,,,,,,2,,,,,,,,,2,,,,,,2,,,,,,1,2,1,2,2,2,2,2,2,2,2,2,2,1,2,,2,,,,,,,,,,,1,1,1,1,1,1,5,3,3,1,1,1,1,1,1,1,1,1,2,1,1,0,8,2,2,2,,,,2,2,,,2,2,,2,2,6,1,4,1,4,4,2,2,2,2,,2,,9,11,2,11,1,Aguascalientes,2,HGZ 1 Aguascalientes,888,1,1.00000000000000000000,8.18858722017432000000,2014-02-25,1
9699,1,HGZ 1 Aguascalientes,11,25,2,14,13,15,13,36,48,2,7,5,3,,1,2,3,1,1,1,5,4,30,12,4,3,0,4,3,0,1,1,1,1,1,1,1,1,1,1,1,2,1,1,1,1,1,1,3,1,7,2,,,,,,,,,,,,2,,,,,,,,,2,,,,,,1,1,,3,2,2,1,2,1,2,2,2,2,2,2,2,2,2,2,1,1,,2,,,,,,,,,,,1,1,2,1,2,2,1,,,,1,99,,,2,1,1,1,99,1,1,0,2,1,,1,2,1,100,2,2,,,1,2,,2,2,5,2,,,,,,,,2,,2,,2,1,4,11,1,Aguascalientes,2,HGZ 1 Aguascalientes,888,1,1.00000000000000000000,10.75932348232790000000,2014-02-25,1
9700,1,HGZ 1 Aguascalientes,11,25,2,14,13,39,14,0,48,2,5,5,3,1,2,2,4,3,3,4,1,0,30,12,2,0,40,2,1,0,1,2,1,1,1,1,1,2,2,2,2,1,2,1,2,2,2,1,4,1,7,2,,,,,,,,,,,,2,,,,,,,,,2,,,,,,1,1,,1,2,,2,2,1,2,1,2,2,2,2,2,2,2,2,2,,,2,,2,,,,,,,,,,1,2,1,2,2,2,,,,3,3,,,2,2,2,2,3,1,1,0,15,1,,2,,,,2,2,,,2,2,,2,2,6,2,,,,,,,,2,,2,,1,2,,11,1,Aguascalientes,2,HGZ 1 Aguascalientes,888,1,1.00000000000000000000,10.75932348232790000000,2014-02-25,1
9704,1,HGZ 1 Aguascalientes,11,25,2,14,18,28,18,58,58,1,4,6,2,1,2,2,4,1,1,3,1,0,30,12,1,0,20,1,0,30,1,2,1,1,1,1,1,1,1,1,1,4,2,1,1,1,1,1,1,2,,2,,,,,,,,,,,,2,,,,,,,,,2,,,,,,2,,,,,,1,2,1,2,2,2,1,2,2,2,2,2,2,1,1,,1,,,,1,,,,,,,1,1,1,1,1,2,1,1,1,1,1,1,1,,2,1,2,2,2,1,1,0,5,1,,2,,,,1,2,,,99,1,,2,2,6,2,,,,,,,,2,,2,,1,2,8,11,1,Aguascalientes,2,HGZ 1 Aguascalientes,888,1,1.00000000000000000000,6.41685706974946000000,2014-02-25,1
9711,1,HGZ 1 Aguascalientes,11,25,2,14,18,29,18,45,27,1,8,7,3,,1,2,4,5,5,2,1,0,20,12,1,0,20,1,0,30,1,2,1,1,2,1,1,1,,1,1,1,1,1,1,1,2,1,1,2,,2,,,,,,,,,,,,2,,,,,,,,,2,,,,,,2,,,,,2,1,2,1,2,1,2,2,2,2,2,2,2,2,1,1,,1,,1,,,,,,,,,1,1,2,1,2,2,1,,,,1,1,,,1,1,1,1,3,1,1,0,10,1,,2,,,,2,2,,,1,2,,2,1,5,2,,,,,,,,2,,2,,1,2,12,11,1,Aguascalientes,2,HGZ 1 Aguascalientes,888,1,1.00000000000000000000,6.55204610848497000000,2014-02-25,1
9712,1,HGZ 1 Aguascalientes,11,25,2,14,19,15,19,33,66,1,7,6,2,1,1,1,3,1,1,3,2,0,40,12,4,3,0,2,1,0,1,1,1,1,1,1,2,1,1,1,,1,1,1,1,1,1,1,2,1,7,2,,,,,,,,,,,,2,,,,,,,,,2,,,,,,1,1,,3,1,,1,1,1,2,2,1,1,1,2,2,2,2,1,2,1,1,1,,,1,1,1,,,,,2,,1,1,1,2,2,1,1,1,1,1,1,,,1,1,1,2,3,2,,,,,,1,99,,,2,2,,,2,2,,2,2,6,2,,,,,,,,2,,2,,1,2,4,11,1,Aguascalientes,2,HGZ 1 Aguascalientes,888,1,1.00000000000000000000,5.39944290709470000000,2014-02-25,1
9713,1,HGZ 1 Aguascalientes,11,25,2,14,19,40,19,59,58,1,2,2,99,,3,2,4,3,3,3,2,0,40,12,2,1,0,2,1,0,1,1,1,1,1,1,1,1,2,1,3,1,1,1,1,1,2,2,,2,,2,,,,,,,,,,,,2,,,,,,,,,2,,,,,,2,,,,,2,2,2,1,2,2,1,2,2,2,2,2,2,2,1,,,1,,,2,,,,,,,,2,1,2,2,2,2,2,,,,,,,,3,3,2,2,5,2,,,,,,1,2,2,,4,2,,,2,2,,2,2,4,2,,,,,,,,3,,1,999,1,3,7,11,1,Aguascalientes,2,HGZ 1 Aguascalientes,888,1,1.00000000000000000000,6.41685706974946000000,2014-02-25,1
9717,1,HGZ 1 Aguascalientes,11,25,2,14,17,39,17,59,63,1,2,10,2,1,3,3,3,3,3,3,2,0,40,12,3,1,20,2,1,0,1,2,2,1,2,1,2,1,,1,,1,1,1,1,1,1,1,4,1,1,2,,,,,,,,,,,,2,,,,,,,,,2,,,,,,2,,,,,,1,1,1,2,2,2,2,2,2,2,2,2,2,1,2,2,2,,,,,,,,,,,2,1,1,1,2,2,2,5,3,5,2,2,,,2,2,2,3,5,1,1,0,15,1,,1,1,,,3,2,,,1,3,,2,2,6,2,,,,,,,,2,,2,,2,7,,11,1,Aguascalientes,2,HGZ 1 Aguascalientes,888,1,1.00000000000000000000,6.41685706974946000000,2014-02-25,1
9718,1,HGZ 1 Aguascalientes,11,25,2,14,18,7,18,28,37,1,7,5,4,,2,2,4,16,16,3,1,0,30,12,2,1,0,2,1,0,1,1,1,1,2,1,2,1,,1,,2,1,1,1,1,2,2,,2,,2,,,,,,,,,,,,2,,,,,,,,,2,,,,,,2,,,,,2,2,1,1,2,2,2,2,2,2,2,2,2,2,1,,1,1,,,,,,,,,,,2,1,2,1,2,2,2,,,,2,2,,,2,2,2,2,3,1,2,0,30,1,,2,,,,2,2,,,99,2,,2,2,4,2,,,,,,,,2,,2,,999,,,11,1,Aguascalientes,2,HGZ 1 Aguascalientes,888,1,1.00000000000000000000,6.99354340850378000000,2014-02-25,1
9719,1,HGZ 1 Aguascalientes,11,25,2,14,18,30,18,49,37,1,6,6,99,1,2,2,4,4,4,2,1,0,30,12,1,0,30,1,0,30,1,2,1,1,2,1,2,2,,2,,2,1,1,1,1,2,1,4,1,5,2,,,,,,,,,,,,2,,,,,,,,,2,,,,,,2,,,,,,1,2,1,2,2,2,2,2,2,2,2,2,2,1,1,,2,,,,,,,,,,,2,1,2,1,2,2,2,,,,2,2,,,2,2,2,2,2,1,1,0,3,1,,2,,,,2,2,,,99,2,,2,2,6,2,,,,,,,,2,,2,,16,,,11,1,Aguascalientes,2,HGZ 1 Aguascalientes,888,1,1.00000000000000000000,6.99354340850378000000,2014-02-25,1
9720,1,HGZ 1 Aguascalientes,11,25,2,14,19,2,19,21,45,1,5,6,99,,2,2,4,2,2,1,1,0,15,12,1,0,30,1,0,30,1,2,2,1,2,1,1,2,,2,2,2,1,1,1,1,1,2,,2,,2,,,,,,,,,,,,2,,,,,,,,,2,,,,,,2,,,,,2,2,1,1,2,1,2,2,2,2,2,2,2,2,1,,1,1,,1,,,,,,,,,1,1,1,1,2,2,2,3,2,2,2,3,,,2,2,2,2,2,1,1,0,2,1,,2,,,,2,2,,,1,2,,2,2,6,2,,,,,,,,2,,2,,999,,,11,1,Aguascalientes,2,HGZ 1 Aguascalientes,888,1,1.00000000000000000000,8.43137394729093000000,2014-02-25,1
9721,1,HGZ 1 Aguascalientes,11,25,2,14,8,37,8,46,32,2,6,2,3,,1,1,4,16,16,2,1,0,25,12,1,0,30,1,0,15,1,2,1,1,2,1,1,1,,1,1,1,2,2,2,2,2,1,3,2,,2,,,,,,,,,,,,2,,,,,,,,,2,,,,,,2,,,,,2,1,2,1,2,1,2,2,2,2,2,2,2,2,1,1,,1,,1,,,,,,,,,1,1,2,1,1,2,2,,,,1,1,1,,1,2,1,1,3,1,1,0,10,1,,1,1,,,2,2,,,2,1,,2,2,6,1,4,6,4,4,2,1,1,2,,2,,1,2,3,11,1,Aguascalientes,2,HGZ 1 Aguascalientes,888,1,1.00000000000000000000,8.36110270912231000000,2014-02-25,1
9723,1,HGZ 1 Aguascalientes,11,25,2,14,9,30,9,49,61,2,4,10,2,,2,2,4,3,3,4,1,0,15,12,1,0,25,1,0,30,2,,,,,,,,,,,,,,,,,1,3,1,1,2,,,,,,,,,,,,2,,,,,,,,,2,,,,,,1,1,,3,2,2,1,1,1,2,1,2,2,1,2,2,2,2,2,2,2,2,2,,2,,,2,,,,,,,1,1,1,2,2,2,2,2,2,2,2,,,1,1,1,1,2,2,,,,,,1,1,,,2,2,,,2,2,,2,2,6,2,,,,,,,,2,,2,,2,8,14,11,1,Aguascalientes,2,HGZ 1 Aguascalientes,888,1,1.00000000000000000000,8.18858722017432000000,2014-02-25,1
9725,1,HGZ 1 Aguascalientes,11,25,2,14,10,25,10,48,74,1,2,6,3,,2,1,4,4,4,4,1,0,10,12,1,0,20,1,0,20,1,2,2,1,1,1,1,2,3,1,1,2,2,1,1,1,1,2,,2,,2,,,,,,,,,,,,2,,,,,,,,,1,1,4,3,3,3,2,,,,,2,1,1,1,2,1,2,2,2,2,2,2,2,2,1,1,4,2,,1,,,,,,,,,2,1,2,1,2,2,1,,,,1,2,,,2,2,2,2,3,1,1,0,5,1,,2,,,,2,1,2,3,99,1,,2,2,5,2,,,,,,,,1,2,2,,1,5,14,11,1,Aguascalientes,2,HGZ 1 Aguascalientes,888,1,1.00000000000000000000,5.39944290709470000000,2014-02-25,1
9731,1,HGZ 1 Aguascalientes,11,25,2,14,20,1,20,20,21,1,9,7,4,,2,2,3,1,1,6,1,0,25,12,1,0,10,1,0,10,1,2,1,1,1,1,1,1,1,1,1,2,1,1,1,2,2,1,3,2,,2,,,,,,,,,,,,2,,,,,,,,,2,,,,,,1,1,,2,2,2,1,2,1,2,2,2,2,2,2,2,2,2,2,2,2,,1,,,,,,,,,,,,1,2,1,2,2,1,,,,1,1,,,1,1,1,1,2,2,,,,,,1,1,,,2,2,,,1,2,,2,2,5,2,,,,,,,,2,,2,,2,7,14,11,1,Aguascalientes,2,HGZ 1 Aguascalientes,888,1,1.00000000000000000000,7.02163845572281000000,2014-02-25,1
9739,1,HGZ 1 Aguascalientes,11,25,2,14,11,30,11,46,56,2,2,10,2,1,2,2,3,1,1,3,1,0,20,12,1,0,15,1,0,15,1,2,1,1,1,1,1,2,2,2,2,1,1,1,1,1,2,1,1,1,1,2,,,,,,,,,,,,2,,,,,,,,,2,,,,,,2,,,,,,1,2,1,2,2,2,2,2,2,2,2,2,2,1,2,,2,,,,,,,,,,,2,1,1,1,2,2,2,2,2,2,2,2,,,2,2,2,2,2,1,1,0,5,1,,1,1,,,2,2,,,2,2,,2,2,2,2,,,,,,,,2,,2,,11,13,,11,1,Aguascalientes,2,HGZ 1 Aguascalientes,888,1,1.00000000000000000000,8.18858722017432000000,2014-02-25,1
9749,1,HGZ 1 Aguascalientes,11,25,2,14,14,33,14,55,35,2,7,5,4,1,2,2,2,3,3,2,1,0,30,12,1,0,30,1,0,30,1,2,1,1,2,1,2,2,,2,,2,1,1,1,1,2,2,,2,,2,,,,,,,,,,,,2,,,,,,,,,2,,,,,,2,,,,,,2,2,1,2,2,2,2,2,2,2,2,2,2,2,,,2,,,,,,,,,,,,1,2,1,2,2,1,,,,2,2,,,2,2,2,2,3,2,,,,,,1,1,,,2,2,,,1,2,,2,2,6,2,,,,,,,,2,,2,,999,,,11,1,Aguascalientes,2,HGZ 1 Aguascalientes,888,1,1.00000000000000000000,8.92449988462098000000,2014-02-25,1
9752,1,HGZ 1 Aguascalientes,11,25,2,14,16,0,16,24,50,1,7,11,4,,2,1,3,2,2,99,1,0,20,12,3,1,30,1,0,20,2,,,,,,,,,,,,,,,,,1,4,1,5,2,,,,,,,,,,,,2,,,,,,,,,2,,,,,,1,1,,2,2,2,1,2,1,2,2,2,1,2,2,2,2,1,2,1,2,,1,,,,1,,,,,4,,2,1,1,1,2,2,1,2,2,3,2,2,,,2,2,2,3,2,2,,,,,,1,1,,,2,2,,,1,2,,2,2,6,2,,,,,,,,2,,2,,1,5,6,11,1,Aguascalientes,2,HGZ 1 Aguascalientes,888,1,1.00000000000000000000,8.43137394729093000000,2014-02-25,1
9753,1,HGZ 1 Aguascalientes,11,25,2,14,16,40,16,58,57,1,2,6,3,1,2,2,3,1,1,2,1,0,30,12,2,0,40,2,0,40,1,2,1,1,1,1,1,2,2,2,2,1,2,1,2,1,2,1,4,1,5,1,1,2,,2,,1,2,,1,2,1,2,,,,,,,,,1,4,5,1,2,2,1,1,,2,2,,1,2,1,2,2,1,1,2,2,2,2,2,2,1,2,,2,,,2,2,,,,,,,2,1,2,1,1,2,2,,,,2,2,2,,2,2,2,2,3,1,1,0,10,1,,1,1,,,2,1,6,3,1,2,,2,2,6,1,5,7,1,1,2,1,2,2,,2,,1,2,7,11,1,Aguascalientes,2,HGZ 1 Aguascalientes,888,1,1.00000000000000000000,6.41685706974946000000,2014-02-25,1
9760,1,HGZ 1 Aguascalientes,11,25,2,14,10,56,11,26,54,2,4,3,3,1,3,4,6,1,1,4,1,0,15,12,1,0,30,1,0,30,1,4,1,1,1,1,1,4,4,4,4,4,2,2,2,2,2,1,4,1,5,2,,,,,,,,,,,,2,,,,,,,,,2,,,,,,1,1,,4,2,,2,2,1,2,2,2,2,2,2,2,2,1,2,2,,,2,,,,,,,,,2,,,1,1,1,1,2,2,2,2,3,2,2,2,,2,2,2,2,3,1,2,0,20,1,,1,2,1,250,4,2,,,99,2,,2,2,6,2,,,,,,,,2,,2,,3,14,,11,1,Aguascalientes,2,HGZ 1 Aguascalientes,888,1,1.00000000000000000000,10.75932348232790000000,2014-02-25,1
9761,1,HGZ 1 Aguascalientes,11,25,2,14,11,57,12,17,63,1,5,6,4,1,2,2,4,3,3,6,1,0,10,12,1,0,10,5,3,30,1,2,1,1,1,2,2,2,2,,,2,2,2,2,2,2,1,3,2,,2,,,,,,,,,,,,2,,,,,,,,,2,,,,,,1,1,,4,2,,2,2,1,2,2,2,2,2,2,2,2,2,2,2,,,3,,,,,,,,,,,,1,1,1,1,2,2,3,3,3,2,2,2,,2,3,2,2,3,2,,,,,,1,1,,,2,2,,,1,2,,2,2,6,2,,,,,,,,2,,2,,7,998,998,11,1,Aguascalientes,2,HGZ 1 Aguascalientes,888,1,1.00000000000000000000,6.41685706974946000000,2014-02-25,1
9772,1,HGZ 1 Aguascalientes,11,25,2,14,15,19,15,38,63,1,4,6,2,1,1,1,4,1,1,4,1,0,20,12,1,0,20,1,0,30,1,2,1,1,2,1,2,2,,2,,1,2,1,1,1,2,1,3,1,4,2,,,,,,,,,,,,2,,,,,,,,,2,,,,,,1,1,,3,2,,1,2,1,2,2,2,1,2,2,2,2,2,2,1,2,,1,,,,2,,,,,,,2,1,1,1,2,2,2,3,3,4,2,2,,,2,2,2,2,4,1,2,0,20,1,,1,1,,,2,2,,,1,2,,2,2,6,1,4,998,2,2,2,1,2,2,,1,3,1,13,14,11,1,Aguascalientes,2,HGZ 1 Aguascalientes,888,1,1.00000000000000000000,6.41685706974946000000,2014-02-25,1
9774,1,HGZ 1 Aguascalientes,11,25,2,14,14,30,14,49,77,2,3,2,1,1,2,2,6,3,3,3,2,0,45,12,2,0,40,1,0,20,1,2,1,1,1,1,1,2,2,2,2,2,1,1,1,1,2,2,,2,,2,,,,,,,,,,,,2,,,,,,,,,2,,,,,,1,1,,2,2,,1,2,1,2,2,2,1,2,2,2,2,2,2,1,2,,2,,,,2,,,,,,,3,1,1,1,2,2,2,3,2,3,2,2,,,2,2,2,2,3,1,1,0,15,1,,1,1,,,2,2,,,1,2,,2,2,5,2,,,,,,,,2,,2,,2,14,15,11,1,Aguascalientes,2,HGZ 1 Aguascalientes,888,1,1.00000000000000000000,6.89025931301020000000,2014-02-25,1
9778,1,HGZ 1 Aguascalientes,11,25,2,14,10,1,10,22,67,1,2,6,1,1,2,2,6,1,1,2,1,0,30,12,1,0,20,2,1,0,2,,,,,,,,,,,,,,,,,2,,1,4,2,,,,,,,,,,,,2,,,,,,,,,2,,,,,,1,1,,2,2,,2,2,2,2,2,2,1,2,2,2,2,2,2,2,,,,,,,2,,,,,,,,2,2,1,1,2,,,,,2,2,2,,2,2,2,2,5,2,,,,,,1,1,,,2,2,,,99,99,,99,99,6,2,,,,,,,,2,,2,,16,,,11,1,Aguascalientes,2,HGZ 1 Aguascalientes,888,1,1.00000000000000000000,5.39944290709470000000,2014-02-25,1
9686,1,HGZ 1 Aguascalientes,11,25,2,14,13,45,14,9,54,1,7,8,3,,1,1,4,1,1,4,1,0,20,15,1,0,20,1,0,20,1,2,1,1,1,1,1,1,1,1,1,2,1,1,1,1,1,1,3,2,,1,3,5,,3,,3,5,,1,1,2,2,,,,,,,,,2,,,,,,1,1,,1,1,2,1,2,1,1,1,1,1,1,2,2,2,2,1,1,1,,1,1,1,1,1,1,,,,,1,1,1,1,1,2,2,1,2,2,2,1,2,,,1,4,1,2,2,1,1,0,10,1,,1,2,1,50,2,2,,,2,1,,2,2,6,1,5,2,16,16,1,2,2,1,999,2,,8,3,14,11,1,Aguascalientes,2,HGZ 1 Aguascalientes,888,1,1.00000000000000000000,8.43137394729093000000,2014-02-25,1
9661,1,HGZ 1 Aguascalientes,11,25,2,14,16,57,17,18,29,2,5,5,3,1,1,2,3,3,3,5,2,0,45,20,2,0,35,1,0,20,1,2,1,1,1,1,1,1,1,1,1,2,1,2,2,2,2,2,,2,,2,,,,,,,,,,,,2,,,,,,,,,2,,,,,,1,1,,3,2,,1,2,1,2,2,2,2,2,2,2,2,1,2,2,1,,1,,,,,,,,,3,,,1,2,1,2,2,1,,,,1,1,,,1,1,1,1,2,2,,,,,,2,,,,2,2,,,1,2,,2,2,6,2,,,,,,,,2,,1,1,2,9,14,11,1,Aguascalientes,2,HGZ 1 Aguascalientes,888,1,1.00000000000000000000,8.36110270912231000000,2014-02-25,1