Folio,Deleg,Unidmed,Id_Unid,Fecha_D,Fecha_M,Fecha_A,Hr_Ini_H,Hr_Ini_M,Hr_Fin_H,Hr_Fin_M,Edad,Sexo,Escolar,Ocupa,Ingreso,Sat1,Sat3,Frecmf,Probsal,Probsal_G,Tprevio,Tprevio_H,Tprevio_M,Gastras,Tmedico,Tmedico_H,Tmedico_M,Tmedreg,Tmedreg_H,Tmedreg_M,Citapre,Comocita,Hrcita,Tdifcons,Diascita,Motcita,Btratou,Preosad,Expclaa_A,Expclaa_B,Expclaa_C,Expclaa_D,Expclab_A,Expclab_B,Expclab_C,Expclab_D,Mopin,Explora,Prevasis_A,Prevasis_B,Prevasis_C,Prevmed_A,Preven1,Preven2,Preven3,Preven4,Calfatna_A,Calfatna_C,Calfatna_D,Calfatna_E,Calfatna_F,Calfatna_G,Calfatna_H,Calfatna_N,Calfatna_K,Calfatna_L,Calfatna_J,Calfatna_M,Calfatna_O,Calfatnb_A,Calfatnb_C,Calfatnb_D,Calfatnb_E,Calfatnb_F,Calfatnb_G,Calfatnb_H,Calfatnb_N,Calfatnb_K,Calfatnb_L,Calfatnb_J,Calfatnb_M,Calfatnb_O,Filtrosaux,Saduni,Gastoest,Temsad,Satlarx,Calfinma_A,Calfinma_B,Calfinma_C,Calfinma_D,Calfinma_E,Calfinmb_A1,Calfinmb_B1,Calfinmb_B2,Calfinmb_B3,Calfinmb_C1,Calfinmb_C2,Calfinmb_D1,Calfinmb_E1,Calfinmb_F,Calfinmb_G,Calfinmb_H,Calfinmb_J,Rgcalinm,Filtrofarm,Tfarsurt,Tfarsurt_H,Tfarsurt_M,Totmed,Acnomed,Farm1,Farm2,Farm5,Farm6,Satmed,Resurt1,Resurt2,Resurt3,Atn1fam,Sat2,Motinsat,Opelec_A,Opelec_C,Prefeserv,Filtroaten,Otroserv,Mot_Otro,Probsal2,Probsal2_G,Trat_Otro,Tmp_Otro,Sat_Otro,Neg_Cons1,Motneg,Neg_Cons2,Neg_Cons3,Recomej_A,Recomej_B,Recomej_C,Id_Unidad,Cve_Delegaci�N,Delegaci�N,Nivel,Unidad,Promedio_Diario2013,Estrato,Moscondia,Fe_Finalnr,Fecha,Entidad
24055,1,UMF 8 Aguascalientes,1,27,2,14,10,0,10,21,77,1,3,10,3,1,1,2,1,1,1,0,10,30,1,0,30,1,0,15,1,1,2,2,4,3,1,1,1,1,1,1,1,2,1,1,1,1,1,1,1,1,2,,2,,1,1,2,2,2,2,2,2,2,2,2,2,2,1,1,,,,,,,,,,,,1,1,,3,2,1,1,1,2,2,3,4,3,5,2,2,,,3,2,2,2,3,1,1,0,10,1,,1,1,,,2,2,,,1,2,,2,2,6,2,,,,,,,,3,,2,,3,1,7,1,1,Aguascalientes,1,UMF 8 Aguascalientes,1222,1,0.25138860316807200000,10.85083328385020000000,2014-02-27,1
24056,1,UMF 8 Aguascalientes,1,27,2,14,18,48,18,59,32,1,6,6,3,2,2,6,2,2,1,0,20,42,1,0,25,1,0,1,2,,,,1,,1,1,1,1,1,1,2,2,2,2,1,2,2,2,2,2,1,1,2,,1,1,2,2,2,2,2,1,2,2,2,2,2,1,1,,,,,,1,,,,,,1,1,,2,1,1,2,1,2,2,1,,,,1,1,,,2,2,2,2,3,1,1,0,3,1,,1,1,,,2,2,,,99,2,,2,2,5,2,,,,,,,,2,,2,,7,2,1,1,1,Aguascalientes,1,UMF 8 Aguascalientes,1222,1,0.25138860316807200000,15.23378934746110000000,2014-02-27,1
24057,1,UMF 8 Aguascalientes,1,27,2,14,19,10,19,32,23,1,5,5,2,1,1,6,7,7,1,0,20,12,1,0,10,1,0,20,2,,,,1,,1,1,1,2,1,1,2,,2,2,2,2,1,1,2,2,1,3,2,,2,1,2,1,2,2,2,1,2,2,2,2,2,,2,,2,,,,2,,,,,,1,1,,2,2,1,2,1,1,2,2,,,,1,1,1,,2,2,2,2,3,1,1,0,5,1,,1,1,,,1,2,,,2,2,,2,2,5,2,,,,,,,,2,,2,,14,2,8,1,1,Aguascalientes,1,UMF 8 Aguascalientes,1222,1,0.25138860316807200000,12.36635436677260000000,2014-02-27,1
24058,1,UMF 8 Aguascalientes,1,27,2,14,20,10,20,15,20,1,5,5,1,1,1,2,5,5,1,0,20,12,1,0,10,1,0,20,1,1,1,,4,3,1,1,1,1,1,1,2,2,2,2,1,1,1,1,2,1,1,3,1,5,1,1,2,1,2,2,2,1,2,2,2,2,2,1,1,,1,,,,1,,,,,,1,1,,3,2,1,1,1,1,1,1,3,3,3,2,2,2,2,1,1,1,1,3,1,1,0,10,1,,1,1,,,1,2,,,2,1,,1,1,6,2,,,,,,,,2,,2,,1,12,14,1,1,Aguascalientes,1,UMF 8 Aguascalientes,1222,1,0.25138860316807200000,12.36635436677260000000,2014-02-27,1
24059,1,UMF 8 Aguascalientes,1,27,2,14,18,2,18,21,23,1,7,3,4,3,3,6,2,2,2,0,40,31,2,1,0,1,0,30,2,,,,1,,3,1,1,2,1,2,1,,2,,2,1,2,2,2,2,2,,1,1,1,2,2,1,2,2,2,1,2,2,2,2,2,4,,,3,,,,3,,,,,,2,,,,,1,2,1,2,2,3,,,,3,3,,,3,2,2,99,4,1,1,0,5,1,,1,1,,,2,2,,,99,3,,1,2,5,1,4,6,7,7,1,1,1,2,,2,,1,12,4,1,1,Aguascalientes,1,UMF 8 Aguascalientes,1222,1,0.25138860316807200000,12.36635436677260000000,2014-02-27,1
24060,1,UMF 8 Aguascalientes,1,27,2,14,17,22,17,48,45,1,5,6,3,2,2,4,1,1,1,0,10,9999,2,0,40,1,0,10,2,,,,1,,2,1,1,1,1,1,2,2,2,2,1,1,1,1,2,2,1,3,2,,1,2,1,2,2,2,2,1,2,2,2,2,2,2,,1,,,,,2,,,,,,2,,,,,1,1,1,2,2,2,2,1,1,2,2,,,2,1,2,1,2,1,1,0,15,1,,1,1,,,2,2,,,2,2,,2,2,6,2,,,,,,,,2,,2,,1,2,7,1,1,Aguascalientes,1,UMF 8 Aguascalientes,1222,1,0.25138860316807200000,17.85472256671550000000,2014-02-27,1
24061,1,UMF 8 Aguascalientes,1,27,2,14,11,13,11,30,20,1,4,5,2,2,2,2,5,5,1,0,20,12,1,0,25,1,0,15,1,1,1,,1,,2,1,1,1,1,1,2,2,2,2,1,1,1,1,2,1,1,1,2,,1,1,2,1,2,2,2,1,2,2,2,2,2,2,2,,2,,,,2,,,,,,1,1,,1,2,1,1,1,2,2,2,4,4,4,2,2,,,2,2,2,2,4,1,5,1,1,1,,1,1,,,2,2,,,2,2,,1,1,6,2,,,,,,,,2,,2,,7,2,11,1,1,Aguascalientes,1,UMF 8 Aguascalientes,1222,1,0.25138860316807200000,12.36635436677260000000,2014-02-27,1
24062,1,UMF 8 Aguascalientes,1,27,2,14,8,39,8,51,26,1,7,6,3,2,3,2,2,2,2,0,40,50,1,0,15,1,0,15,1,2,2,3,3,2,1,1,1,1,2,2,2,2,,,3,1,1,1,2,2,1,3,2,,1,1,1,2,2,2,2,1,1,2,2,1,1,1,1,2,,,,,2,2,,,2,4,1,2,,3,2,1,1,1,2,2,2,4,4,4,2,4,,,2,2,2,4,4,2,,,,,,1,1,,,2,2,,,2,2,,1,1,5,1,5,999,2,2,1,1,1,2,,1,5,7,13,1,1,1,Aguascalientes,1,UMF 8 Aguascalientes,1222,1,0.25138860316807200000,15.23378934746110000000,2014-02-27,1
24063,1,UMF 8 Aguascalientes,1,27,2,14,11,31,11,50,36,1,7,2,3,2,2,3,2,2,1,0,25,12,1,0,20,1,0,10,1,3,2,2,3,1,2,1,1,1,1,1,1,1,1,1,1,1,1,1,2,2,1,3,1,7,1,1,2,2,2,2,2,1,2,2,2,2,2,2,1,,,,,,2,,,,,,2,,,,,1,1,1,2,2,2,5,5,3,2,2,,,2,1,1,1,4,1,1,0,5,1,,1,2,2,,3,2,,,1,2,,1,1,5,2,,,,,,,,2,,2,,3,7,11,1,1,Aguascalientes,1,UMF 8 Aguascalientes,1222,1,0.25138860316807200000,19.60990758487430000000,2014-02-27,1
24064,1,UMF 8 Aguascalientes,1,27,2,14,12,3,12,22,27,1,6,6,3,1,1,4,2,2,2,0,45,18,2,0,40,1,0,15,2,,,,1,,2,1,1,2,1,1,2,,1,1,1,1,1,1,1,2,1,2,2,,1,1,2,2,2,2,2,1,2,2,2,2,2,2,2,,,,,,2,,,,,,2,,,,,1,2,1,2,2,2,,,,2,3,,,2,2,2,3,3,1,1,0,10,1,,1,1,,,2,2,,,1,2,,2,2,5,2,,,,,,,,2,,2,,2,8,998,1,1,Aguascalientes,1,UMF 8 Aguascalientes,1222,1,0.25138860316807200000,15.23378934746110000000,2014-02-27,1
24065,1,UMF 8 Aguascalientes,1,27,2,14,12,46,13,7,52,2,4,2,3,4,4,6,3,3,1,0,25,0,2,0,45,2,1,0,1,4,1,,3,3,4,1,1,1,1,1,3,3,3,3,3,2,2,2,2,2,2,,2,,1,1,2,2,2,2,1,1,2,2,2,2,2,4,4,,,,,3,3,,,,,,1,1,,1,3,1,1,1,2,1,3,4,4,3,3,4,,3,4,3,2,99,4,1,1,0,15,1,,1,1,,,3,2,,,1,4,1,1,1,5,2,,,,,,,,2,,2,,1,14,4,1,1,Aguascalientes,1,UMF 8 Aguascalientes,1222,1,0.25138860316807200000,22.36411229101120000000,2014-02-27,1
24066,1,UMF 8 Aguascalientes,1,27,2,14,13,19,13,42,18,2,6,5,3,3,3,6,3,3,1,0,30,6,2,1,0,2,1,0,3,,,,1,,3,1,1,2,1,1,2,,2,2,2,2,2,2,2,2,1,3,1,7,1,1,2,2,2,2,2,1,2,2,2,2,2,2,2,,,,,,2,,,,,,2,,,,,1,1,1,2,2,99,5,3,3,3,3,,,2,3,2,99,5,1,1,0,15,1,,2,,,,3,2,,,1,3,,1,2,5,2,,,,,,,,2,,2,,1,7,10,1,1,Aguascalientes,1,UMF 8 Aguascalientes,1222,1,0.25138860316807200000,15.48960151329960000000,2014-02-27,1
24067,1,UMF 8 Aguascalientes,1,27,2,14,15,28,15,48,44,1,7,5,2,3,3,2,1,1,3,1,30,50,2,1,0,1,0,15,2,,,,1,,2,2,1,2,1,2,3,,3,,3,1,1,1,2,2,1,4,2,,1,2,1,2,2,2,2,1,2,2,2,2,2,2,,2,,,,,2,,,,,,1,1,,4,2,1,1,1,2,2,2,3,2,2,2,2,,,1,2,2,1,3,1,2,0,20,1,,2,,,,3,2,,,1,2,,2,2,6,2,,,,,,,,2,,1,1,1,3,9,1,1,Aguascalientes,1,UMF 8 Aguascalientes,1222,1,0.25138860316807200000,19.60990758487430000000,2014-02-27,1
24068,1,UMF 8 Aguascalientes,1,27,2,14,10,58,11,20,27,1,5,6,3,4,4,6,4,4,1,0,20,20,4,2,30,5,6,0,2,,,,1,,5,1,1,2,2,1,2,,,2,4,2,2,2,2,2,1,2,2,,1,1,2,2,2,2,2,1,2,2,2,2,2,2,3,,,,,,2,,,,,,2,,,,,1,2,1,2,2,4,,,,4,2,,,3,3,4,4,5,1,1,0,7,1,,2,,,,4,2,,,1,5,2,1,1,4,1,4,2,4,4,1,1,1,1,10,1,2,999,,,1,1,Aguascalientes,1,UMF 8 Aguascalientes,1222,1,0.25138860316807200000,15.23378934746110000000,2014-02-27,1
24069,1,UMF 8 Aguascalientes,1,27,2,14,10,17,10,41,33,1,5,6,4,4,4,1,7,7,2,1,0,50,1,0,5,3,2,0,1,3,1,,2,1,3,1,1,1,1,1,1,1,1,1,3,1,1,1,1,2,2,,1,7,1,2,1,2,2,2,2,2,2,2,2,2,2,2,,2,,,,,,,,,,,2,,,,,1,1,1,1,2,2,2,5,2,2,99,1,,2,2,2,2,4,1,1,0,5,1,,2,,,,2,2,,,99,2,,1,1,5,2,,,,,,,,1,13,1,6,3,2,1,1,1,Aguascalientes,1,UMF 8 Aguascalientes,1222,1,0.25138860316807200000,15.23378934746110000000,2014-02-27,1
24070,1,UMF 8 Aguascalientes,1,27,2,14,10,40,11,8,64,1,3,5,1,4,4,1,4,4,1,0,20,35,3,2,0,3,2,0,4,,,,1,,4,1,1,1,1,1,3,3,3,3,2,2,2,2,2,2,2,,1,1,1,1,2,2,2,2,2,1,2,2,2,2,2,5,3,,,,,,3,,,,,,2,,,,,1,2,1,2,2,3,,,,3,3,,,3,2,2,2,4,1,2,0,30,2,2,2,,,,4,2,,,1,4,1,1,1,5,2,,,,,,,,2,,1,1,1,8,14,1,1,Aguascalientes,1,UMF 8 Aguascalientes,1222,1,0.25138860316807200000,12.31262602397670000000,2014-02-27,1
24071,1,UMF 8 Aguascalientes,1,27,2,14,13,53,14,6,54,1,3,6,2,5,5,6,7,7,1,0,10,12,2,1,0,2,1,0,2,,,,1,,5,3,2,2,2,2,,,,,4,2,2,2,2,2,2,,2,,1,1,2,2,2,2,2,2,2,2,2,2,2,4,4,,,,,,,,,,,,2,,,,,1,2,1,2,2,2,,,,2,2,,,2,2,2,2,3,2,,,,,,2,,,,3,2,,,1,4,1,2,2,5,1,4,8,4,4,2,1,2,1,10,1,1,998,14,4,1,1,Aguascalientes,1,UMF 8 Aguascalientes,1222,1,0.25138860316807200000,17.85472256671550000000,2014-02-27,1
24072,1,UMF 8 Aguascalientes,1,27,2,14,14,5,14,24,19,1,6,7,99,2,2,6,7,7,1,0,15,20,1,0,20,1,0,20,2,,,,1,,2,1,1,1,1,1,2,2,2,2,1,1,1,1,2,1,1,4,2,,1,1,2,2,2,2,2,1,2,2,2,2,2,2,2,,,,,,2,,,,,,2,,,,,1,2,1,2,2,2,,,,2,2,,,2,2,2,2,99,1,1,0,5,1,,1,1,,,2,2,,,1,2,,1,2,6,2,,,,,,,,3,,2,,1,2,10,1,1,Aguascalientes,1,UMF 8 Aguascalientes,1222,1,0.25138860316807200000,12.36635436677260000000,2014-02-27,1
24073,1,UMF 8 Aguascalientes,1,27,2,14,13,43,13,59,25,1,5,6,3,2,2,6,8,8,1,0,20,35,3,1,30,3,1,30,2,,,,1,,2,1,1,1,1,1,2,2,2,2,1,1,1,1,1,1,1,4,1,1,1,1,2,2,2,2,2,2,2,2,2,2,2,2,2,,,,,,,,,,,,2,,,,,1,1,1,2,2,2,3,3,3,2,2,,,2,2,2,4,4,2,,,,,,1,1,,,2,2,,,2,2,,2,2,6,2,,,,,,,,2,,2,,2,8,,1,1,Aguascalientes,1,UMF 8 Aguascalientes,1222,1,0.25138860316807200000,12.36635436677260000000,2014-02-27,1
24074,1,UMF 8 Aguascalientes,1,27,2,14,13,23,13,40,80,1,1,6,2,2,2,2,1,1,2,0,35,25,1,0,20,1,0,20,1,1,1,,4,3,2,1,1,1,1,1,2,2,2,2,1,1,1,1,2,1,2,,1,1,1,1,2,1,2,1,1,1,1,2,2,2,2,2,2,,2,,2,2,2,2,,,,,1,1,,3,2,1,2,1,2,2,2,,,,2,2,,,2,2,2,2,2,1,1,0,5,2,2,1,2,2,,4,2,,,1,2,,1,2,6,2,,,,,,,,2,,1,4,1,3,7,1,1,Aguascalientes,1,UMF 8 Aguascalientes,1222,1,0.25138860316807200000,10.85083328385020000000,2014-02-27,1
24075,1,UMF 8 Aguascalientes,1,27,2,14,12,0,13,17,42,1,2,6,3,2,2,2,1,1,1,0,15,24,1,0,20,1,0,20,1,1,1,,2,3,2,1,1,1,1,1,2,2,2,2,1,1,1,1,1,99,1,3,1,1,1,1,2,2,2,1,1,1,2,2,2,2,2,2,2,,,,2,2,2,,,,,,1,1,,2,2,1,1,1,1,1,1,4,4,4,2,2,2,2,2,2,2,2,4,1,1,0,10,1,,1,1,,,2,2,,,2,1,,1,1,6,2,,,,,,,,2,,2,,2,7,9,1,1,Aguascalientes,1,UMF 8 Aguascalientes,1222,1,0.25138860316807200000,19.60990758487430000000,2014-02-27,1
24076,1,UMF 8 Aguascalientes,1,27,2,14,12,40,12,58,47,1,2,6,3,2,2,2,4,4,1,0,30,12,1,0,30,1,0,30,2,,,,1,,2,1,1,1,1,1,2,2,2,2,1,1,1,1,1,1,2,,1,1,1,1,2,2,2,2,2,1,2,2,2,2,2,2,2,,,,,,2,,,,,,2,,,,,1,1,1,2,2,2,4,4,4,2,2,,,2,2,2,2,4,1,1,0,5,1,,1,1,,,2,2,,,2,2,,2,2,6,2,,,,,,,,2,,2,,7,2,3,1,1,Aguascalientes,1,UMF 8 Aguascalientes,1222,1,0.25138860316807200000,17.85472256671550000000,2014-02-27,1
24077,1,UMF 8 Aguascalientes,1,27,2,14,12,19,12,37,63,2,2,5,3,2,2,2,1,1,1,0,15,12,1,0,10,1,0,10,1,1,1,,2,3,2,1,1,1,1,1,2,2,2,2,1,1,1,1,1,1,1,3,2,,1,1,2,1,2,2,2,1,2,2,2,2,2,2,2,,2,,,,2,,,,,,1,1,,3,2,1,2,1,2,2,2,,,,2,2,,,2,2,2,2,2,1,1,0,5,1,,1,1,,,2,2,,,2,2,,2,2,6,2,,,,,,,,2,,2,,16,3,11,1,1,Aguascalientes,1,UMF 8 Aguascalientes,1222,1,0.25138860316807200000,15.42230353725940000000,2014-02-27,1
24078,1,UMF 8 Aguascalientes,1,27,2,14,11,58,12,15,54,1,2,6,3,2,2,2,1,1,1,0,25,12,1,0,20,1,0,20,1,1,2,3,5,3,1,1,1,1,1,1,2,2,2,2,1,1,1,1,1,1,1,1,2,,1,1,2,1,2,1,2,1,2,2,2,2,2,2,2,,2,,2,,2,,,,,,1,1,,4,2,1,1,1,1,2,4,4,4,4,2,2,2,,2,2,2,2,4,1,1,0,5,2,2,1,1,,,2,2,,,2,2,,2,2,6,2,,,,,,,,2,,2,,7,1,3,1,1,Aguascalientes,1,UMF 8 Aguascalientes,1222,1,0.25138860316807200000,17.85472256671550000000,2014-02-27,1
24079,1,UMF 8 Aguascalientes,1,27,2,14,11,35,11,52,18,1,5,5,2,2,2,6,7,7,1,0,30,32,2,1,0,3,1,30,2,,,,1,,2,1,1,2,1,1,2,,2,2,1,1,1,1,2,1,1,3,2,,1,1,2,2,2,2,2,1,2,2,2,2,2,2,2,,,,,,2,,,,,,2,,,,,1,1,1,2,2,2,4,4,4,2,2,,,2,2,2,2,4,1,1,0,5,1,,1,1,,,2,2,,,2,2,,2,2,6,2,,,,,,,,3,,2,,7,1,13,1,1,Aguascalientes,1,UMF 8 Aguascalientes,1222,1,0.25138860316807200000,12.36635436677260000000,2014-02-27,1
24080,1,UMF 8 Aguascalientes,1,27,2,14,10,52,11,10,64,1,2,6,3,2,2,2,1,1,1,0,10,30,4,3,0,4,3,0,1,1,2,3,4,3,2,1,1,1,1,1,2,2,2,2,1,1,1,1,1,1,1,4,2,,1,1,2,1,2,1,2,1,2,2,2,2,2,2,2,,2,,2,,2,,,,,,1,1,,4,2,1,2,1,2,2,2,,,,2,1,,,2,2,2,2,2,1,1,0,5,1,,1,1,,,2,2,,,2,2,,1,1,6,2,,,,,,,,3,,2,,2,1,7,1,1,Aguascalientes,1,UMF 8 Aguascalientes,1222,1,0.25138860316807200000,12.31262602397670000000,2014-02-27,1
24081,1,UMF 8 Aguascalientes,1,27,2,14,15,40,15,53,63,1,1,6,2,2,2,1,1,1,2,1,0,24,1,0,15,1,0,15,1,1,1,,2,1,2,1,1,1,1,1,1,3,2,1,1,2,1,1,1,1,1,4,1,5,1,1,2,1,2,2,2,1,1,2,2,1,2,2,2,,2,,,,2,2,,,2,,2,,,,,1,1,1,2,2,99,2,2,3,2,2,,,2,2,2,2,2,1,2,0,30,2,1,1,2,1,9999,4,2,,,2,3,,2,2,6,2,,,,,,,,2,,2,,3,2,14,1,1,Aguascalientes,1,UMF 8 Aguascalientes,1222,1,0.25138860316807200000,12.31262602397670000000,2014-02-27,1
24082,1,UMF 8 Aguascalientes,1,27,2,14,15,20,15,33,48,1,5,11,3,3,3,1,1,1,1,0,15,50,2,1,0,1,0,5,1,2,2,3,4,3,2,2,1,2,1,1,2,,2,2,4,2,2,2,2,1,1,2,2,,2,1,2,2,2,2,2,1,2,2,2,2,2,,2,,,,,,3,,,,,,1,1,,1,1,1,1,1,2,2,4,5,4,4,4,3,,,4,2,2,2,5,1,1,0,5,1,,1,1,,,4,2,,,1,3,,1,1,5,2,,,,,,,,1,999,1,999,998,12,1,1,1,Aguascalientes,1,UMF 8 Aguascalientes,1222,1,0.25138860316807200000,17.85472256671550000000,2014-02-27,1
24083,1,UMF 8 Aguascalientes,1,27,2,14,15,3,15,16,34,2,5,3,4,3,3,1,1,1,1,0,30,24,2,0,40,1,0,30,1,2,2,3,2,1,3,2,1,2,1,1,2,,2,2,2,2,1,1,2,1,1,1,1,998,2,1,2,2,2,2,2,1,2,2,2,2,2,,2,,,,,,2,,,,,,2,,,,,1,2,1,2,2,2,,,,3,4,,,2,2,2,2,4,1,1,0,15,1,,1,2,1,300,3,2,,,1,3,,1,1,6,1,2,8,1,1,2,1,2,1,999,1,1,998,3,7,1,1,Aguascalientes,1,UMF 8 Aguascalientes,1222,1,0.25138860316807200000,19.08123603216000000000,2014-02-27,1
24084,1,UMF 8 Aguascalientes,1,27,2,14,17,10,17,27,46,1,4,2,3,2,2,6,4,4,1,0,30,24,1,0,20,1,0,20,4,,,,2,1,2,1,1,1,1,1,2,2,2,2,2,1,1,1,2,1,1,3,1,4,1,1,2,2,2,1,2,1,2,2,2,2,2,1,1,,,,1,,2,,,,,,1,1,,1,2,1,1,1,1,2,2,4,4,4,2,2,1,,1,1,1,1,4,1,1,0,3,1,,1,1,,,2,2,,,2,2,,2,2,6,2,,,,,,,,2,,2,,7,11,14,1,1,Aguascalientes,1,UMF 8 Aguascalientes,1222,1,0.25138860316807200000,17.85472256671550000000,2014-02-27,1
24085,1,UMF 8 Aguascalientes,1,27,2,14,8,45,9,0,67,1,6,6,1,2,2,1,1,1,1,0,20,40,1,0,30,2,0,40,1,1,1,,5,3,2,1,1,2,1,1,2,,2,2,2,1,1,1,1,1,2,,1,7,1,1,2,2,2,2,2,1,2,2,2,2,2,2,2,,,,,,2,,,,,,2,,,,,1,1,1,2,2,2,5,5,5,2,2,,,2,2,2,2,5,1,1,0,15,1,,1,2,2,,4,99,,,99,2,,2,2,999,2,,,,,,,,2,,2,,3,7,15,1,1,Aguascalientes,1,UMF 8 Aguascalientes,1222,1,0.25138860316807200000,10.85083328385020000000,2014-02-27,1
24086,1,UMF 8 Aguascalientes,1,27,2,14,15,40,15,55,64,1,3,6,3,1,1,2,1,1,1,0,30,24,2,0,45,2,0,45,1,1,2,3,5,3,1,1,1,1,1,1,1,1,1,1,1,1,1,1,1,1,1,3,2,,1,1,2,2,2,2,2,1,2,2,2,2,2,1,1,,,,,,1,,,,,,2,,,,,1,2,1,1,2,1,,,,1,1,2,,1,1,1,1,3,1,2,0,30,1,,1,1,,,4,2,,,1,5,3,2,2,5,1,999,9,1,1,1,1,1,2,,2,,3,1,7,1,1,Aguascalientes,1,UMF 8 Aguascalientes,1222,1,0.25138860316807200000,12.31262602397670000000,2014-02-27,1
24087,1,UMF 8 Aguascalientes,1,27,2,14,16,10,16,36,18,1,7,6,3,1,1,6,6,998,1,0,30,12,1,0,20,1,0,20,1,2,2,2,4,1,2,1,1,1,1,1,1,1,1,1,1,2,1,1,2,2,1,2,1,2,1,1,2,2,2,2,2,1,2,2,2,2,2,1,1,,,,,,1,,,,,,2,,,,,1,2,1,2,2,2,,,,1,1,,,1,1,1,1,99,1,1,0,4,1,,1,1,,,3,2,,,2,2,,1,1,1,1,3,7,4,4,2,2,1,2,,1,3,3,8,15,1,1,Aguascalientes,1,UMF 8 Aguascalientes,1222,1,0.25138860316807200000,12.36635436677260000000,2014-02-27,1
24088,1,UMF 8 Aguascalientes,1,27,2,14,16,42,16,59,47,1,1,12,2,1,1,6,1,1,1,0,30,40,4,3,0,1,0,10,1,2,2,3,1,,4,1,1,1,1,1,1,1,1,1,1,1,2,2,2,1,1,3,2,,1,1,2,2,2,1,2,1,2,2,2,1,2,1,1,,,,1,,99,,,,1,,1,1,,5,1,1,2,1,2,2,1,,,,1,1,,,1,1,1,1,2,1,1,0,5,1,,1,1,,,1,2,,,99,1,,2,2,6,2,,,,,,,,2,,2,,2,1,8,1,1,Aguascalientes,1,UMF 8 Aguascalientes,1222,1,0.25138860316807200000,17.85472256671550000000,2014-02-27,1
24089,1,UMF 8 Aguascalientes,1,27,2,14,17,2,17,25,33,1,5,6,3,1,1,2,6,998,1,0,30,12,1,0,5,1,0,2,1,1,1,,4,2,1,1,1,2,1,1,1,,1,1,1,1,1,1,2,2,1,3,1,3,1,1,2,1,2,2,2,2,2,2,2,2,2,1,1,,1,,,,,,,,,,2,,,,,1,1,1,2,2,1,3,3,3,1,1,,,1,1,1,1,3,2,,,,,,1,2,2,,2,2,,,2,1,,2,2,6,2,,,,,,,,2,,2,,7,2,14,1,1,Aguascalientes,1,UMF 8 Aguascalientes,1222,1,0.25138860316807200000,15.23378934746110000000,2014-02-27,1
24090,1,UMF 8 Aguascalientes,1,27,2,14,17,30,17,46,40,1,3,3,3,1,1,2,1,1,1,0,15,12,1,0,10,1,0,10,1,4,1,,2,1,1,1,1,2,1,1,1,,1,1,1,1,1,1,1,1,1,3,1,5,1,1,2,2,2,2,2,1,2,1,2,2,2,1,1,,,,,,1,,3,,,,1,1,,1,1,1,1,1,1,2,2,4,4,4,2,2,1,,1,1,1,1,5,1,1,0,10,1,,1,1,,,1,2,,,2,1,,2,2,6,1,4,6,4,4,2,3,4,2,,1,4,7,6,15,1,1,Aguascalientes,1,UMF 8 Aguascalientes,1222,1,0.25138860316807200000,19.60990758487430000000,2014-02-27,1
24091,1,UMF 8 Aguascalientes,1,27,2,14,13,14,13,26,48,2,9,3,4,3,3,6,4,4,1,0,15,15,4,2,30,9997,9997,9997,2,,,,1,,3,1,1,2,1,2,2,,2,,3,1,1,1,2,1,1,2,2,,1,1,2,2,2,2,2,1,2,2,2,2,2,2,3,,,,,,2,,,,,,2,,,,,1,2,1,2,2,3,,,,3,3,,,3,3,3,3,4,1,1,0,5,1,,2,,,,3,2,,,1,3,,2,2,5,2,,,,,,,,3,,2,,2,5,9,1,1,Aguascalientes,1,UMF 8 Aguascalientes,1222,1,0.25138860316807200000,22.36411229101120000000,2014-02-27,1
24092,1,UMF 8 Aguascalientes,1,27,2,14,13,32,13,42,50,1,3,6,3,2,2,1,17,998,1,0,20,50,1,0,30,9999,9999,9999,2,,,,1,,2,1,2,2,1,1,,,2,2,1,1,2,2,2,2,1,3,2,,2,2,1,2,2,2,2,1,2,2,2,2,2,,,2,,,,,2,,,,,,2,,,,,1,2,1,2,2,2,,,,2,1,,,2,2,2,2,3,1,1,0,15,1,,2,,,,2,2,,,2,2,,2,2,6,1,2,998,1,1,2,3,3,3,,1,999,3,,,1,1,Aguascalientes,1,UMF 8 Aguascalientes,1222,1,0.25138860316807200000,17.85472256671550000000,2014-02-27,1
24093,1,UMF 8 Aguascalientes,1,27,2,14,14,50,15,8,74,2,2,10,3,2,2,2,1,1,1,0,15,30,1,0,15,1,0,15,1,1,1,,5,3,2,1,1,1,1,1,2,2,2,2,1,1,1,1,2,1,1,3,2,,1,1,2,2,2,2,2,1,2,2,2,2,2,2,2,,,,,,4,,,,,,2,,,,,1,2,1,2,2,2,,,,2,2,,,2,2,2,2,99,1,1,0,5,2,2,1,2,1,250,4,2,,,2,2,,2,2,6,2,,,,,,,,2,,2,,3,1,10,1,1,Aguascalientes,1,UMF 8 Aguascalientes,1222,1,0.25138860316807200000,13.59132034140080000000,2014-02-27,1
24094,1,UMF 8 Aguascalientes,1,27,2,14,15,16,15,34,34,1,5,12,2,2,2,2,1,1,1,0,30,45,1,0,30,1,0,30,1,1,1,,4,3,2,1,1,1,1,1,2,2,1,2,1,1,1,1,2,1,2,,2,,1,1,2,2,2,1,1,1,2,2,2,2,2,2,1,,,,2,2,2,,,,,,1,1,,3,2,1,1,1,1,1,1,4,4,4,2,2,2,2,2,1,2,2,4,1,1,0,10,1,,1,2,2,,4,2,,,2,2,,1,1,2,1,2,6,7,7,2,1,2,2,,1,4,2,1,10,1,1,Aguascalientes,1,UMF 8 Aguascalientes,1222,1,0.25138860316807200000,15.23378934746110000000,2014-02-27,1
24095,1,UMF 8 Aguascalientes,1,27,2,14,16,19,16,37,37,1,5,12,2,2,2,3,1,1,1,0,5,9999,2,0,40,1,0,20,1,3,2,3,2,1,1,1,1,1,1,1,1,1,1,1,1,1,1,1,2,2,1,4,2,,1,2,1,2,2,2,2,1,2,2,2,2,2,2,,1,,,,,2,,,,,,2,,,,,1,2,1,2,2,2,,,,1,1,,,1,1,1,1,3,1,1,0,3,1,,1,2,2,,2,2,,,1,3,,2,2,5,2,,,,,,,,2,,2,,3,7,,1,1,Aguascalientes,1,UMF 8 Aguascalientes,1222,1,0.25138860316807200000,19.60990758487430000000,2014-02-27,1
24096,1,UMF 8 Aguascalientes,1,27,2,14,16,43,17,1,56,1,2,6,2,2,2,2,1,1,1,0,30,24,1,0,30,1,0,30,1,1,2,3,5,3,2,1,1,1,1,1,1,2,1,2,1,1,1,1,2,1,1,2,1,1,1,1,2,2,2,2,2,1,2,2,2,1,2,1,1,,,,,,1,,,,1,,2,,,,,1,1,1,2,2,1,4,4,4,2,2,,,1,1,1,1,4,1,1,0,10,1,,1,1,,,2,2,,,2,2,,2,2,6,2,,,,,,,,2,,2,,2,11,998,1,1,Aguascalientes,1,UMF 8 Aguascalientes,1222,1,0.25138860316807200000,12.31262602397670000000,2014-02-27,1
24097,1,UMF 8 Aguascalientes,1,27,2,14,12,11,12,23,27,2,7,3,3,2,2,1,4,4,1,0,10,50,1,0,5,1,0,5,1,3,1,,2,1,2,1,1,1,1,1,1,2,1,2,1,1,1,1,2,1,1,4,2,,1,1,2,2,2,1,2,1,2,2,2,2,2,2,2,,,,3,,2,,,,,,2,,,,,1,2,1,2,2,2,,,,3,3,,,3,2,3,2,3,1,1,0,3,1,,1,2,1,200,2,2,,,2,2,,2,2,6,2,,,,,,,,2,,2,,998,,,1,1,Aguascalientes,1,UMF 8 Aguascalientes,1222,1,0.25138860316807200000,19.08123603216000000000,2014-02-27,1
24099,1,UMF 8 Aguascalientes,1,27,2,14,12,48,13,3,23,1,5,3,3,2,2,5,4,4,2,1,0,12,4,2,30,1,0,15,2,,,,1,,2,1,1,2,1,1,2,,2,2,1,1,1,1,1,1,1,4,2,,1,1,2,2,2,2,2,1,2,2,1,2,2,1,2,,,,,,2,,,2,,,2,,,,,1,1,1,2,2,2,2,2,3,2,2,,,2,2,2,2,3,1,1,0,5,1,,2,,,,2,2,,,2,2,,2,2,6,2,,,,,,,,2,,2,,8,2,,1,1,Aguascalientes,1,UMF 8 Aguascalientes,1222,1,0.25138860316807200000,12.36635436677260000000,2014-02-27,1
24100,1,UMF 8 Aguascalientes,1,27,2,14,16,2,16,15,40,1,5,6,1,3,3,2,7,7,2,0,40,27,1,0,5,3,2,0,1,2,1,,2,1,1,1,1,1,2,2,3,3,,,1,1,1,1,2,1,1,2,1,998,1,1,2,1,2,2,2,2,2,2,2,2,2,2,1,,2,,,,,,,,,,1,1,,2,2,1,1,1,2,2,2,2,2,2,2,2,,,2,2,2,2,2,2,,,,,,1,1,,,2,2,,,2,2,,2,2,6,1,5,6,7,7,1,1,2,2,,1,4,2,998,,1,1,Aguascalientes,1,UMF 8 Aguascalientes,1222,1,0.25138860316807200000,19.60990758487430000000,2014-02-27,1
24101,1,UMF 8 Aguascalientes,1,27,2,14,10,17,10,35,22,1,7,2,3,3,3,2,7,7,1,0,15,12,1,0,10,1,0,5,1,3,2,1,2,1,2,2,1,2,1,1,2,,1,1,2,1,1,1,2,2,1,3,2,,1,1,2,2,2,2,2,1,2,2,2,2,2,2,2,,,,,,2,,,,,,2,,,,,1,2,1,2,2,1,,,,1,1,,,1,1,1,1,99,1,2,0,18,1,,1,2,1,200,3,2,,,1,2,,2,2,5,2,,,,,,,,2,,2,,2,3,10,1,1,Aguascalientes,1,UMF 8 Aguascalientes,1222,1,0.25138860316807200000,12.36635436677260000000,2014-02-27,1
24102,1,UMF 8 Aguascalientes,1,27,2,14,9,45,10,0,39,1,6,6,1,2,2,4,4,4,1,0,30,40,1,0,25,2,0,40,1,3,1,,1,,2,3,1,1,1,1,2,2,2,2,3,1,1,1,1,2,1,2,1,7,1,1,2,2,2,2,2,1,2,2,99,2,99,2,2,,,,,,2,,,,,,2,,,,,1,1,1,2,2,2,4,4,4,2,2,,,2,2,2,2,4,1,9999,9999,9999,1,,1,1,,,2,2,,,99,3,,2,2,999,2,,,,,,,,2,,1,2,3,8,,1,1,Aguascalientes,1,UMF 8 Aguascalientes,1222,1,0.25138860316807200000,19.60990758487430000000,2014-02-27,1
24103,1,UMF 8 Aguascalientes,1,27,2,14,8,29,8,57,40,1,5,3,2,3,3,2,1,1,1,0,15,35,1,0,10,1,0,10,1,2,1,,3,98,2,1,1,1,1,1,2,2,2,2,1,2,2,2,2,1,2,,2,,2,1,2,1,2,2,2,1,2,2,2,2,2,,3,,5,,,,4,,,,,,2,,,,,1,2,1,2,2,2,,,,2,2,,,3,2,2,2,5,1,1,0,5,1,,1,1,,,3,2,,,1,3,,1,2,4,1,4,998,6,6,2,1,1,2,,1,5,1,7,9,1,1,Aguascalientes,1,UMF 8 Aguascalientes,1222,1,0.25138860316807200000,19.60990758487430000000,2014-02-27,1
24104,1,UMF 8 Aguascalientes,1,27,2,14,8,5,8,21,33,1,6,6,99,2,2,6,4,4,1,0,3,24,3,1,30,3,1,30,2,,,,1,,2,1,1,1,1,1,4,4,4,4,1,1,2,2,2,2,1,4,2,,1,1,2,2,2,2,2,1,2,2,2,2,2,2,1,,,,,,2,,,,,,1,1,,1,1,1,1,1,1,2,1,2,3,2,2,2,2,,2,2,2,2,4,1,1,0,2,1,,2,,,,2,2,,,1,4,7,1,1,6,2,,,,,,,,2,,1,3,4,7,,1,1,Aguascalientes,1,UMF 8 Aguascalientes,1222,1,0.25138860316807200000,15.23378934746110000000,2014-02-27,1
24105,1,UMF 8 Aguascalientes,1,27,2,14,9,15,9,30,31,1,8,6,2,2,2,2,1,1,2,0,40,30,2,0,35,2,0,50,2,,,,1,,3,1,1,2,1,1,3,,3,3,3,1,1,1,2,1,1,3,1,7,1,1,2,2,2,2,2,1,2,2,2,2,2,3,2,,,,,,3,,,,,,2,,,,,1,2,1,2,2,3,,,,3,2,,,3,3,3,3,4,1,1,0,5,1,,1,1,,,2,99,,,1,3,,2,2,999,2,,,,,,,,2,,2,,3,7,15,1,1,Aguascalientes,1,UMF 8 Aguascalientes,1222,1,0.25138860316807200000,15.23378934746110000000,2014-02-27,1
24106,1,UMF 8 Aguascalientes,1,27,2,14,17,50,18,5,43,2,5,2,1,2,1,2,1,1,1,0,15,100,1,0,15,1,0,30,1,2,1,,3,3,1,1,1,1,1,1,3,3,3,3,4,1,1,1,2,1,1,1,1,5,1,1,2,1,2,2,2,1,2,2,2,2,2,1,4,,1,,,,1,,,,,,1,2,,2,4,1,2,1,2,2,1,,,,1,1,,,1,1,1,1,3,1,1,0,10,1,,1,1,,,1,2,,,1,4,4,2,2,6,2,,,,,,,,2,,2,,4,15,14,1,1,Aguascalientes,1,UMF 8 Aguascalientes,1222,1,0.25138860316807200000,24.56258693495660000000,2014-02-27,1
24108,1,UMF 8 Aguascalientes,1,27,2,14,18,21,18,32,20,2,7,2,2,2,2,6,7,7,1,0,20,20,1,0,30,1,0,30,2,,,,1,,2,1,1,1,1,1,2,2,2,2,1,1,1,1,2,1,1,3,2,,1,1,2,2,2,2,2,1,2,2,2,2,2,1,1,,,,,,2,,,,,,2,,,,,1,1,1,2,2,2,2,2,2,2,2,,,2,2,2,2,2,1,1,0,10,1,,1,1,,,2,2,,,2,2,,2,2,6,2,,,,,,,,2,,2,,2,11,998,1,1,Aguascalientes,1,UMF 8 Aguascalientes,1222,1,0.25138860316807200000,15.48960151329960000000,2014-02-27,1
24109,1,UMF 8 Aguascalientes,1,27,2,14,17,57,18,15,45,1,2,6,3,1,1,6,2,2,1,0,15,30,1,0,20,1,0,30,2,,,,1,,2,1,1,1,1,1,1,1,1,1,1,1,1,1,2,1,1,3,1,2,1,1,2,2,2,2,2,1,2,2,2,2,2,2,2,,,,,,2,,,,,,1,1,,2,2,1,1,1,1,1,1,2,2,4,2,2,2,2,2,2,2,2,2,1,2,0,30,1,,1,1,,,2,2,,,2,2,,2,2,5,1,2,1,7,7,2,1,2,3,,1,7,2,12,998,1,1,Aguascalientes,1,UMF 8 Aguascalientes,1222,1,0.25138860316807200000,17.85472256671550000000,2014-02-27,1
24110,1,UMF 8 Aguascalientes,1,27,2,14,17,33,17,51,39,1,5,6,2,2,2,2,1,1,1,0,20,30,1,0,15,1,0,30,1,1,1,,4,3,1,1,1,1,1,2,2,2,2,,1,1,1,1,2,1,1,3,1,3,1,1,2,2,2,1,1,1,2,2,2,2,2,2,2,,,,2,2,3,,,,,,1,1,,1,2,1,1,1,1,1,2,4,4,4,2,2,2,2,1,1,1,1,4,1,1,0,10,2,2,1,2,2,,3,2,,,2,2,,2,2,6,2,,,,,,,,2,,2,,3,7,10,1,1,Aguascalientes,1,UMF 8 Aguascalientes,1222,1,0.25138860316807200000,19.60990758487430000000,2014-02-27,1
24111,1,UMF 8 Aguascalientes,1,27,2,14,18,3,18,45,23,1,5,5,3,1,1,2,5,5,2,0,45,12,1,0,10,1,0,10,1,1,1,,4,3,1,1,1,1,1,1,1,1,1,1,1,1,1,1,2,1,1,3,1,4,1,1,2,1,2,2,2,1,2,2,2,2,2,1,1,,1,,,,1,,,,,,1,1,,3,1,1,2,1,1,2,1,,,,1,1,1,,1,1,1,1,3,1,1,0,5,1,,1,1,,,1,2,,,2,1,,2,2,6,2,,,,,,,,3,,2,,2,12,14,1,1,Aguascalientes,1,UMF 8 Aguascalientes,1222,1,0.25138860316807200000,12.36635436677260000000,2014-02-27,1
24112,1,UMF 8 Aguascalientes,1,27,2,14,8,59,9,18,39,1,7,3,4,4,4,2,1,1,2,0,40,6,2,0,56,2,0,50,1,2,2,2,4,98,5,1,1,1,1,1,2,2,2,2,3,2,2,2,2,2,1,1,1,7,1,1,2,2,2,1,2,1,2,2,2,2,2,5,4,,,,2,,4,,,,,,1,1,,3,2,1,2,1,1,2,2,,,,2,3,2,,2,2,2,4,4,1,1,0,10,2,2,1,2,1,100,5,2,,,1,5,1,1,1,4,1,4,4,4,4,1,1,1,2,,2,,1,2,3,1,1,Aguascalientes,1,UMF 8 Aguascalientes,1222,1,0.25138860316807200000,19.60990758487430000000,2014-02-27,1