folio,deleg,id_unid,unidmed,fecha_d,fecha_m,fecha_a,hr_ini_h,hr_ini_m,hr_fin_h,hr_fin_m,edad,servatn,tipopac,sat1,sat3,probsal,citapre,comocita,diascita,hrcita,tmedreg2,durasis_c,preosad,tratocomf,filtroref,totorpase1,tiem_esp1,proscesoref_1,proscesoref_2,proscesoref_3,proscesoref_4,proscesoref_5,proscesoref_6,satprocref,sattempref,conocunifila,filtroUNIFILA,comptmpunif,tmpespunif,satmedUnif,preven3,filtrosaux1,temsad1,temsad1a,filtrosaux2,temsad2,temsad2a,recmedhoy,filtrofarm2,tfarsurt,totmed,motnosurt,btratou,calfatna_a,calfatnb_a,calfatna_c,calfatnb_c,calfatna_e,calfatnb_e,calfatna_f,calfatnb_f,calfatna_g,calfatnb_g,calfatna_h,calfatnb_h,calfatna_n,calfatnb_n,calfatna_k,calfatnb_k,calfatna_l,calfatnb_l,calfatna_j,calfatnb_j,calfatna_m,calfatnb_m,calfatna_o,calfatnb_o,saludar,escuchar,responder,tiemuv,mejoratratou,gafet,tratoigual,btratou2,calfinmb_f,limp1,limp2,recomej_a,recomej_b,recomej_c,sugeren,turno,sexo,escolar,id_unidad,Cve_Delegaci�n,Delegaci�n,Nivel,Promedio_diario2015,Estrato,MOSCondia,FE_FinalNR
100007,1,1,UMF 8 Aguascalientes,28,6,2016,10,6,10,13,19,1,1,2,1,56,1,2,2,1,1,1,1,2,2,,,,,,,,,,,2,,,,,3,2,,,2,,,2,2,,,,1,1,10,1,10,2,,1,10,2,,2,,2,,2,,2,,2,,2,,2,,1,1,1,1,1,1,1,10,1,1,1,12,,,996,1,2,7,1,1,Aguascalientes,1,1294,203,1,15.10743002
100008,1,1,UMF 8 Aguascalientes,28,6,2016,14,28,14,35,19,1,1,2,3,13,1,4,2,1,4,1,1,2,2,,,,,,,,,,,1,2,,,,1,1,1,1,1,99,1,1,1,1,1,,2,1,10,1,10,2,,2,,1,10,2,,1,10,2,,2,,2,,2,,2,,1,1,1,1,1,1,1,10,2,6,,20,,,996,1,2,5,1,1,Aguascalientes,1,1294,203,1,15.10743002
100009,1,1,UMF 8 Aguascalientes,28,6,2016,11,32,11,41,21,1,1,2,2,40,1,2,2,1,3,1,1,2,2,,,,,,,,,,,1,1,1,2,2,3,2,,,2,,,2,2,,,,1,1,10,1,10,2,,2,,1,10,2,,2,,2,,2,,2,,2,,2,,1,1,1,3,1,1,1,10,1,2,1,12,,,996,1,2,7,1,1,Aguascalientes,1,1294,203,1,15.10743002
100010,1,1,UMF 8 Aguascalientes,28,6,2016,14,45,14,56,22,1,1,1,2,3,1,1,,3,2,1,1,2,1,1,1,1,,,,,,1,1,1,2,,,,1,1,2,1,2,,,2,1,1,3,20,1,2,,1,10,2,,2,,2,,1,8,1,10,2,,2,,2,,2,,2,,1,1,1,1,1,1,1,10,2,4,1,5,,,1,2,1,5,1,1,Aguascalientes,1,1294,203,1,14.88430703
100011,1,1,UMF 8 Aguascalientes,28,6,2016,11,18,11,25,22,1,1,2,2,14,2,,,,3,1,1,2,2,,,,,,,,,,,2,,,,,3,1,1,1,2,,,1,1,1,1,,2,1,10,1,10,2,,2,,1,10,2,,1,10,2,,2,,2,,2,,2,,2,1,1,5,1,1,1,10,2,4,2,4,8,9,996,1,1,5,1,1,Aguascalientes,1,1294,203,1,14.88430703
100012,1,1,UMF 8 Aguascalientes,28,6,2016,12,18,12,25,22,1,1,4,4,15,1,3,2,1,2,1,2,1,2,,,,,,,,,,,1,1,1,1,2,3,1,1,1,2,,,2,2,,,,4,2,,1,1,1,1,2,,1,10,2,,2,,2,,2,,2,,2,,2,,1,1,1,3,2,1,1,1,4,5,2,5,1,10,996,1,1,5,1,1,Aguascalientes,1,1294,203,1,14.88430703
100013,1,1,UMF 8 Aguascalientes,28,6,2016,13,19,13,25,22,1,2,2,2,19,1,2,2,1,1,2,1,2,2,,,,,,,,,,,2,,,,,3,1,2,1,2,,,1,1,1,1,,2,2,,1,8,2,,2,,1,8,2,,1,9,2,,2,,2,,2,,2,,2,1,1,1,2,1,1,8,2,6,,7,4,,996,1,1,8,1,1,Aguascalientes,1,1294,203,1,14.88430703
100014,1,1,UMF 8 Aguascalientes,28,6,2016,14,19,14,27,23,1,1,2,2,4,1,1,,1,1,1,1,2,2,,,,,,,,,,,1,1,1,2,1,3,2,,,2,,,1,99,,,,1,1,9,1,10,2,,2,,2,,2,,1,8,2,,2,,2,,2,,2,,1,1,1,1,1,1,1,9,2,6,,12,,,996,2,2,9,1,1,Aguascalientes,1,1294,203,1,15.10743002
100015,1,1,UMF 8 Aguascalientes,28,6,2016,17,4,17,12,23,1,2,2,2,7,2,,,,3,1,1,2,2,,,,,,,,,,,1,1,2,4,2,3,1,1,1,2,,,1,1,1,1,,1,1,8,1,10,2,,2,,2,,2,,1,8,2,,2,,2,,2,,2,,2,1,1,2,1,1,1,10,1,6,,4,,,996,2,1,5,1,1,Aguascalientes,1,1294,203,1,14.88430703
100016,1,1,UMF 8 Aguascalientes,28,6,2016,11,4,11,11,23,1,1,2,2,3,1,1,,1,1,1,1,2,2,,,,,,,,,,,2,,,,,2,1,1,1,1,1,1,1,1,1,1,,2,1,10,1,10,2,,2,,2,,2,,1,10,2,,2,,2,,2,,2,,99,1,1,2,1,1,1,10,2,2,1,12,,,996,1,1,5,1,1,Aguascalientes,1,1294,203,1,14.88430703
100017,1,1,UMF 8 Aguascalientes,28,6,2016,15,17,15,24,23,1,1,2,1,4,2,,,,3,1,1,2,2,,,,,,,,,,,2,,,,,3,2,,,1,1,2,1,1,1,1,,1,1,9,1,10,2,,2,,2,,2,,1,10,2,,2,,2,,2,,2,,1,1,1,2,2,1,1,10,2,6,,9,,,996,2,1,5,1,1,Aguascalientes,1,1294,203,1,14.88430703
100018,1,1,UMF 8 Aguascalientes,28,6,2016,10,16,10,23,25,1,1,2,2,40,1,1,,1,1,1,1,2,2,,,,,,,,,,,2,,,,,3,2,,,2,,,2,2,,,,2,1,10,1,10,2,,2,,2,,2,,2,,2,,2,,2,,2,,2,,1,1,1,5,2,1,1,10,2,6,,12,,,996,1,1,5,1,1,Aguascalientes,1,1294,203,1,14.88430703
100019,1,1,UMF 8 Aguascalientes,28,6,2016,17,48,17,55,28,1,1,4,2,11,2,,,,1,1,1,2,2,,,,,,,,,,,1,1,1,1,1,2,1,1,2,1,1,1,1,1,1,1,,2,1,9,1,10,2,,2,,2,,2,,1,10,2,,2,,2,,2,,2,,1,1,1,3,3,1,1,10,2,5,1,1,4,7,3,2,1,9,1,1,Aguascalientes,1,1294,203,1,14.33707033
100020,1,1,UMF 8 Aguascalientes,28,6,2016,9,9,9,17,28,1,2,2,2,9,1,2,1,1,2,1,1,1,2,,,,,,,,,,,1,1,1,1,2,3,2,,,2,,,1,1,1,1,,2,1,8,1,8,2,,1,10,2,,2,,1,10,2,,2,,2,,2,,2,,1,1,1,99,,99,1,10,2,6,,12,,,996,1,1,5,1,1,Aguascalientes,1,1294,203,1,14.33707033
100021,1,1,UMF 8 Aguascalientes,28,6,2016,8,21,8,29,30,1,1,2,2,12,2,,,,4,2,1,1,2,,,,,,,,,,,2,,,,,3,2,,,2,,,1,1,1,1,,3,2,,1,5,2,,2,,2,,2,,1,10,2,,2,,2,,2,,2,,2,2,1,5,2,2,99,5,4,4,2,1,5,6,996,1,2,5,1,1,Aguascalientes,1,1294,203,1,14.55198997
100022,1,1,UMF 8 Aguascalientes,28,6,2016,16,34,16,43,30,1,1,2,2,4,1,4,2,1,3,1,1,2,2,,,,,,,,,,,2,,,,,3,2,,,1,1,1,1,1,1,1,,2,1,10,1,10,2,,2,,2,,2,,1,10,2,,2,,2,,2,,2,,1,1,1,1,2,1,1,10,2,6,,5,4,,996,2,1,5,1,1,Aguascalientes,1,1294,203,1,14.33707033
100023,1,1,UMF 8 Aguascalientes,28,6,2016,17,41,17,53,30,1,1,2,2,7,1,3,2,1,1,2,1,2,1,1,6,1,4,3,,,,2,2,2,,,,,1,1,3,1,2,,,1,1,1,1,,2,1,6,1,10,2,,2,,2,,2,,1,8,2,,2,,2,,2,,2,,1,1,1,3,1,1,99,8,2,4,1,12,,,13,2,2,7,1,1,Aguascalientes,1,1294,203,1,14.55198997
100024,1,1,UMF 8 Aguascalientes,28,6,2016,14,39,14,46,30,1,2,1,1,13,1,2,2,1,1,1,1,2,2,,,,,,,,,,,1,1,2,4,4,3,2,,,2,,,1,1,1,1,,2,1,8,1,10,2,,2,,2,,2,,2,,2,,2,,2,,2,,2,,1,1,1,5,1,1,1,10,2,6,,4,,,996,2,1,5,1,1,Aguascalientes,1,1294,203,1,14.33707033
100025,1,1,UMF 8 Aguascalientes,28,6,2016,15,11,15,19,30,1,1,4,4,18,2,,,,3,1,1,1,2,,,,,,,,,,,1,1,1,3,2,2,2,,,2,,,1,1,1,1,,2,1,7,1,5,2,,2,,2,,2,,1,8,2,,2,,2,,2,,2,,1,1,1,5,1,1,1,10,1,2,2,4,6,7,1,2,2,5,1,1,Aguascalientes,1,1294,203,1,14.55198997
100026,1,1,UMF 8 Aguascalientes,28,6,2016,10,35,10,42,30,1,1,3,3,9,2,,,,4,1,1,2,2,,,,,,,,,,,1,1,3,4,3,3,2,,,2,,,1,1,1,1,,3,1,7,1,7,2,,2,,2,,2,,1,8,2,,2,,2,,2,,2,,1,1,1,5,2,1,2,8,2,6,,1,2,4,996,1,1,7,1,1,Aguascalientes,1,1294,203,1,14.33707033
100027,1,1,UMF 8 Aguascalientes,28,6,2016,14,40,14,48,30,1,1,2,2,3,1,2,2,1,1,1,2,1,2,,,,,,,,,,,2,,,,,3,1,1,1,2,,,1,1,99,1,,2,1,9,1,9,2,,2,,2,,2,,1,9,1,8,2,,2,,2,,2,,99,1,1,1,2,1,1,9,2,6,,12,,,996,2,1,5,1,1,Aguascalientes,1,1294,203,1,14.33707033
100028,1,1,UMF 8 Aguascalientes,28,6,2016,14,5,14,12,30,1,2,2,2,35,1,2,2,1,1,1,1,2,2,,,,,,,,,,,1,2,,,,3,2,,,2,,,1,1,1,1,,2,1,10,1,10,2,,2,,2,,2,,1,10,2,,1,9,2,,2,,2,,1,1,1,1,2,1,1,10,2,2,1,12,,,996,1,1,5,1,1,Aguascalientes,1,1294,203,1,14.33707033
100029,1,1,UMF 8 Aguascalientes,28,6,2016,9,16,9,22,31,1,1,2,2,21,2,,,,1,1,1,2,2,,,,,,,,,,,2,,,,,2,2,,,2,,,1,1,1,1,,1,1,10,1,10,1,10,2,,2,,2,,1,10,2,,2,,2,,2,,2,,2,1,1,3,3,1,1,10,2,6,,6,8,,996,1,2,5,1,1,Aguascalientes,1,1294,203,1,14.55198997
100030,1,1,UMF 8 Aguascalientes,28,6,2016,15,42,15,48,31,1,1,4,4,3,1,1,,1,2,1,1,2,2,,,,,,,,,,,1,2,,,,2,1,3,1,2,,,2,2,,,,2,2,,2,,1,8,2,,2,,2,,2,,1,1,2,,2,,2,,2,,1,1,1,3,2,1,1,8,2,6,,4,,,996,2,1,5,1,1,Aguascalientes,1,1294,203,1,14.33707033
100031,1,1,UMF 8 Aguascalientes,28,6,2016,13,11,13,19,32,1,1,3,3,6,1,1,,2,1,2,1,2,2,,,,,,,,,,,2,,,,,3,1,1,1,2,,,1,1,1,1,,2,1,8,1,10,2,,2,,2,,2,,1,10,2,,2,,2,,2,,2,,1,1,1,1,2,1,1,9,2,2,1,1,11,7,1,1,1,5,1,1,Aguascalientes,1,1294,203,1,14.33707033
100032,1,1,UMF 8 Aguascalientes,28,6,2016,15,44,15,51,36,1,1,4,4,3,2,,,,3,1,2,2,2,,,,,,,,,,,1,1,1,3,2,2,2,,,2,,,1,1,1,2,1,2,2,,1,10,2,,2,,2,,2,,2,,2,,2,,2,,2,,2,,2,1,1,1,2,2,1,10,4,4,2,2,1,10,2,2,1,5,1,1,Aguascalientes,1,1294,203,1,16.29409614
100033,1,1,UMF 8 Aguascalientes,28,6,2016,18,27,18,40,36,1,1,3,2,24,2,,,,2,1,1,2,2,,,,,,,,,,,2,,,,,2,2,,,2,,,1,1,1,1,,2,2,,1,9,2,,2,,2,,2,,1,9,2,,2,,2,,2,,2,,1,1,1,3,3,1,1,8,4,5,2,5,1,10,10,2,1,3,1,1,Aguascalientes,1,1294,203,1,16.29409614
100034,1,1,UMF 8 Aguascalientes,28,6,2016,14,5,14,12,37,1,1,1,1,1,2,,,,1,1,1,1,1,2,5,2,1,3,4,,,1,2,2,,,,,3,2,,,2,,,1,1,1,1,,1,1,10,1,10,2,,2,,1,8,2,,1,8,1,10,2,,2,,1,10,1,10,1,1,1,5,2,1,1,10,2,6,,12,,,996,1,1,5,1,1,Aguascalientes,1,1294,203,1,16.29409614
100035,1,1,UMF 8 Aguascalientes,28,6,2016,9,24,9,39,37,1,2,2,2,7,2,,,,3,1,1,2,2,,,,,,,,,,,1,1,2,4,2,1,2,,,1,1,1,1,1,1,1,,2,1,8,1,8,2,,2,,2,,2,,1,8,2,,1,2,2,,2,,2,,1,1,1,1,2,1,99,7,2,4,2,3,1,,9,1,1,5,1,1,Aguascalientes,1,1294,203,1,16.29409614
100036,1,1,UMF 8 Aguascalientes,28,6,2016,9,43,9,51,37,1,1,2,2,2,2,,,,4,2,1,2,1,1,1,999,,,,,,99,2,2,,,,,2,2,,,2,,,1,1,1,1,,1,1,9,1,9,2,,2,,2,,2,,1,9,1,10,2,,2,,1,10,2,,1,1,1,1,1,1,1,10,2,1,1,999,,,14,1,2,5,1,1,Aguascalientes,1,1294,203,1,16.53835255
100037,1,1,UMF 8 Aguascalientes,28,6,2016,17,14,17,22,37,1,1,2,5,18,1,3,3,4,4,1,1,2,2,,,,,,,,,,,1,2,,,,2,1,1,1,1,2,1,1,1,1,1,,3,1,9,1,10,2,,2,,2,,2,,1,8,2,,1,1,2,,2,,2,,1,1,1,1,3,1,1,8,2,6,,1,,,996,2,2,9,1,1,Aguascalientes,1,1294,203,1,16.53835255
100038,1,1,UMF 8 Aguascalientes,28,6,2016,8,25,8,35,39,1,1,2,3,19,2,,,,4,1,1,2,2,,,,,,,,,,,2,,,,,2,1,4,1,1,1,1,1,1,1,1,,2,1,10,1,10,2,,2,,2,,2,,1,9,2,,2,,2,,2,,2,,1,2,1,1,1,1,1,9,2,6,,10,1,7,14,1,2,7,1,1,Aguascalientes,1,1294,203,1,16.53835255
100039,1,1,UMF 8 Aguascalientes,28,6,2016,18,58,19,6,40,1,1,2,2,20,1,2,2,1,1,1,1,2,2,,,,,,,,,,,2,,,,,3,2,,,2,,,1,1,1,1,,1,1,9,1,10,2,,2,,1,9,2,,1,9,2,,2,,2,,2,,2,,1,1,1,1,1,1,1,10,2,6,,5,,,996,2,1,3,1,1,Aguascalientes,1,1294,203,1,16.29409614
100040,1,1,UMF 8 Aguascalientes,28,6,2016,16,48,16,59,40,1,1,1,2,7,2,,,,3,1,1,2,2,,,,,,,,,,,1,1,1,3,2,3,2,,,2,,,1,1,1,1,,1,1,10,1,10,1,10,2,,2,,2,,1,10,2,,1,10,2,,2,,2,,1,99,1,1,1,1,1,10,2,2,1,5,,,996,2,1,7,1,1,Aguascalientes,1,1294,203,1,16.29409614
100041,1,1,UMF 8 Aguascalientes,28,6,2016,13,25,13,32,41,1,2,2,2,24,1,1,,1,1,1,1,1,2,,,,,,,,,,,2,,,,,2,2,,,2,,,1,1,1,1,,2,1,10,1,10,2,,2,,2,,2,,1,10,2,,2,,2,,2,,2,,1,1,1,2,1,1,1,10,2,2,1,20,,,996,1,1,5,1,1,Aguascalientes,1,1294,203,1,16.29409614
100042,1,1,UMF 8 Aguascalientes,28,6,2016,8,35,8,45,42,1,1,2,2,11,2,,,,1,1,1,2,2,,,,,,,,,,,1,2,,,,2,2,,,1,4,1,1,1,1,1,,1,1,10,1,10,2,,2,,2,,2,,1,10,2,,2,,2,,2,,2,,1,1,1,4,2,1,1,10,2,6,,4,9,6,996,1,1,5,1,1,Aguascalientes,1,1294,203,1,16.29409614
100043,1,1,UMF 8 Aguascalientes,28,6,2016,15,25,15,38,45,1,2,2,2,19,2,,,,5,1,2,2,2,,,,,,,,,,,1,1,3,5,2,2,2,,,2,,,1,1,1,1,,2,1,10,1,9,1,10,2,,2,,2,,1,9,2,,2,,2,,1,9,2,,1,1,1,5,1,1,1,9,2,2,1,3,6,7,996,2,1,5,1,1,Aguascalientes,1,1294,203,1,14.2538
100044,1,1,UMF 8 Aguascalientes,28,6,2016,13,33,13,42,46,1,1,2,2,4,1,2,3,3,2,1,1,2,2,,,,,,,,,,,1,2,,,,1,1,5,1,2,,,1,1,1,1,,2,1,6,1,10,2,,2,,2,,1,10,1,10,2,,2,,2,,2,,2,,1,99,1,1,1,1,1,10,2,5,2,1,5,7,996,1,1,3,1,1,Aguascalientes,1,1294,203,1,14.2538
100045,1,1,UMF 8 Aguascalientes,28,6,2016,10,22,10,30,46,1,1,2,2,1,1,1,,1,1,1,1,2,2,,,,,,,,,,,2,,,,,2,1,2,1,2,,,1,1,1,1,,2,1,10,1,10,1,10,2,,2,,2,,1,10,2,,2,,2,,2,,2,,1,1,1,2,1,2,99,10,2,4,1,5,,,996,1,1,2,1,1,Aguascalientes,1,1294,203,1,14.2538
100046,1,1,UMF 8 Aguascalientes,28,6,2016,9,0,9,7,47,1,1,2,2,7,2,,,,4,1,1,2,2,,,,,,,,,,,2,,,,,3,2,,,2,,,1,1,1,1,,1,1,10,1,10,2,,2,,2,,2,,1,10,2,,2,,2,,2,,2,,1,1,1,2,1,99,1,10,2,2,1,20,,,996,1,1,7,1,1,Aguascalientes,1,1294,203,1,14.2538
100047,1,1,UMF 8 Aguascalientes,28,6,2016,11,26,11,32,47,1,1,2,2,24,1,3,3,1,1,2,2,2,2,,,,,,,,,,,2,,,,,2,2,,,2,,,1,1,1,2,7,2,1,10,1,6,2,,2,,2,,2,,1,8,2,,2,,2,,2,,2,,1,1,2,2,3,1,2,9,2,6,,7,,,996,1,1,5,1,1,Aguascalientes,1,1294,203,1,14.2538
100048,1,1,UMF 8 Aguascalientes,28,6,2016,16,57,17,6,47,1,1,5,5,47,1,3,2,1,1,1,1,2,2,,,,,,,,,,,2,,,,,2,2,,,2,,,1,1,1,1,,2,1,9,1,9,2,,2,,1,10,1,6,1,10,1,8,2,,2,,2,,2,,1,1,1,4,1,1,1,9,2,2,1,1,10,,996,2,1,3,1,1,Aguascalientes,1,1294,203,1,14.2538
100049,1,1,UMF 8 Aguascalientes,28,6,2016,13,38,13,46,48,1,1,4,2,1,1,2,2,1,1,1,2,2,2,,,,,,,,,,,2,,,,,2,2,,,2,,,1,1,1,1,,3,1,10,1,6,2,,2,,1,8,2,,1,8,2,,2,,2,,2,,2,,2,1,1,3,2,1,2,8,5,5,2,1,,,996,1,1,3,1,1,Aguascalientes,1,1294,203,1,14.2538
100050,1,1,UMF 8 Aguascalientes,28,6,2016,17,4,17,20,48,1,2,2,2,17,2,,,,3,1,1,2,2,,,,,,,,,,,1,1,3,5,2,1,2,,,1,2,1,1,1,1,1,,1,1,10,1,10,2,,2,,2,,2,,1,9,2,,2,,2,,2,,2,,1,1,1,1,1,1,1,10,2,6,,5,4,,996,2,1,7,1,1,Aguascalientes,1,1294,203,1,14.2538
100051,1,1,UMF 8 Aguascalientes,28,6,2016,12,8,12,19,49,1,1,1,1,1,1,1,,1,1,1,1,2,2,,,,,,,,,,,2,,,,,2,2,,,2,,,1,1,1,1,,1,2,,1,10,1,10,2,,2,,1,10,1,10,2,,1,10,2,,2,,2,,1,1,1,2,2,1,1,10,2,4,1,9,,,25,1,1,7,1,1,Aguascalientes,1,1294,203,1,14.2538
100052,1,1,UMF 8 Aguascalientes,28,6,2016,16,28,16,38,49,1,1,4,4,16,1,3,2,1,2,2,1,1,1,5,,1,2,3,4,,,5,5,2,,,,,2,2,,,2,,,2,2,,,,2,1,6,1,6,2,,2,,2,,2,,2,,2,,1,6,2,,1,6,2,,2,1,2,4,3,2,1,5,4,4,2,6,7,10,38,2,1,7,1,1,Aguascalientes,1,1294,203,1,14.2538
100053,1,1,UMF 8 Aguascalientes,28,6,2016,15,52,16,0,51,1,1,4,4,1,1,1,,1,1,2,1,1,1,1,1,2,,,,,,4,4,99,,,,,3,2,,,2,,,2,2,,,,2,2,,1,10,1,10,2,,2,,2,,2,,2,,2,,2,,2,,2,,2,1,1,1,2,1,1,10,5,5,1,1,3,7,5,2,2,3,1,1,Aguascalientes,1,1294,203,1,14.46747138
100054,1,1,UMF 8 Aguascalientes,28,6,2016,13,43,13,51,51,1,1,1,1,31,1,2,3,1,2,1,1,2,2,,,,,,,,,,,1,2,,,,2,2,,,2,,,1,1,1,1,,1,1,7,1,8,2,,2,,2,,2,,1,10,2,,2,,2,,2,,2,,2,2,2,4,3,1,1,8,3,6,,1,30,,996,1,1,5,1,1,Aguascalientes,1,1294,203,1,14.2538
100055,1,1,UMF 8 Aguascalientes,28,6,2016,12,27,12,40,52,1,1,4,2,4,1,2,1,1,2,2,1,1,1,2,5,1,2,,,,,2,2,2,,,,,3,2,,,1,6,2,2,2,,,,2,1,7,1,10,2,,2,,2,,2,,2,,2,,2,,2,,1,8,1,8,2,2,2,3,3,2,1,8,4,5,2,1,9,5,21,1,1,7,1,1,Aguascalientes,1,1294,203,1,14.2538
100056,1,1,UMF 8 Aguascalientes,28,6,2016,16,8,16,20,52,1,1,3,3,2,1,2,2,1,3,1,1,2,2,,,,,,,,,,,1,2,,,,2,1,3,1,2,,,1,1,1,2,1,3,1,8,1,10,2,,2,,2,,2,,1,8,2,,2,,2,,2,,2,,2,1,1,1,2,1,1,9,2,2,1,1,10,11,996,2,2,5,1,1,Aguascalientes,1,1294,203,1,14.46747138
100057,1,1,UMF 8 Aguascalientes,28,6,2016,14,52,14,59,53,1,1,2,2,14,1,1,,1,1,1,1,2,2,,,,,,,,,,,2,,,,,2,1,1,1,1,1,1,2,2,,,,2,1,10,1,10,1,10,2,,2,,2,,2,,2,,2,,2,,2,,2,,1,1,1,2,1,1,1,10,1,2,2,1,4,7,996,2,2,2,1,1,Aguascalientes,1,1294,203,1,14.46747138
100058,1,1,UMF 8 Aguascalientes,28,6,2016,16,13,16,20,54,1,1,3,3,4,1,3,3,1,1,1,1,2,2,,,,,,,,,,,2,,,,,2,1,99,1,2,,,1,1,1,1,,2,2,,1,10,2,,2,,2,,2,,2,,2,,2,,2,,2,,2,,2,1,1,4,2,1,1,9,2,2,2,2,1,9,2,2,1,5,1,1,Aguascalientes,1,1294,203,1,14.2538
100059,1,1,UMF 8 Aguascalientes,28,6,2016,19,0,19,9,55,1,1,2,2,12,1,3,2,1,2,2,2,1,2,,,,,,,,,,,2,,,,,2,2,,,2,,,1,1,1,1,,2,2,,1,9,2,,2,,2,,1,10,1,10,2,,2,,2,,2,,2,,2,1,1,3,2,1,1,10,3,4,2,1,2,5,5,2,1,2,1,1,Aguascalientes,1,1294,203,1,14.053974
100060,1,1,UMF 8 Aguascalientes,28,6,2016,12,46,12,54,55,1,1,1,1,2,1,1,,1,1,1,1,2,2,,,,,,,,,,,2,,,,,2,1,5,1,2,,,1,1,1,1,,1,1,10,1,10,2,,2,,2,,2,,1,10,2,,1,10,2,,2,,2,,1,1,1,4,2,1,1,10,2,6,,10,,,10,1,2,7,1,1,Aguascalientes,1,1294,203,1,14.26464988
100061,1,1,UMF 8 Aguascalientes,28,6,2016,12,26,12,38,56,1,1,2,2,1,1,1,,1,1,1,1,2,2,,,,,,,,,,,99,,,,,2,2,,,2,,,1,1,1,1,,2,1,10,1,10,2,,2,,2,,2,,1,10,2,,2,,2,,2,,2,,1,1,1,2,1,1,1,10,2,6,,20,,,996,1,1,3,1,1,Aguascalientes,1,1294,203,1,14.053974
100062,1,1,UMF 8 Aguascalientes,28,6,2016,16,38,16,46,56,1,1,4,4,47,1,2,2,1,2,2,2,2,2,,,,,,,,,,,2,,,,,3,2,,,2,,,1,1,1,1,,3,2,,1,2,2,,2,,2,,2,,1,10,2,,2,,2,,2,,2,,2,2,1,5,2,99,1,6,4,6,,1,7,9,996,2,1,7,1,1,Aguascalientes,1,1294,203,1,14.053974
100063,1,1,UMF 8 Aguascalientes,28,6,2016,15,23,15,31,57,1,1,2,2,21,2,,,,3,1,1,2,2,,,,,,,,,,,2,,,,,3,2,,,2,,,1,1,1,1,,99,1,10,1,10,2,,2,,2,,2,,1,10,2,,2,,2,,2,,2,,2,1,1,2,1,99,2,10,2,3,1,5,,,996,2,1,1,1,1,Aguascalientes,1,1294,203,1,14.053974
100064,1,1,UMF 8 Aguascalientes,28,6,2016,9,55,10,3,58,1,1,2,2,2,1,1,,1,1,1,1,2,2,,,,,,,,,,,2,,,,,3,2,,,2,,,1,1,1,1,,2,1,8,1,10,2,,2,,1,10,1,10,1,10,2,,2,,2,,2,,2,,1,1,1,2,1,1,1,9,2,6,,12,,,996,1,2,7,1,1,Aguascalientes,1,1294,203,1,14.26464988
100065,1,1,UMF 8 Aguascalientes,28,6,2016,8,7,8,17,58,1,1,2,2,21,2,,,,2,1,1,2,2,,,,,,,,,,,2,,,,,1,1,2,1,2,,,1,1,1,1,,2,1,9,1,10,1,10,2,,2,,2,,1,9,2,,2,,2,,2,,2,,1,1,1,1,1,1,1,10,2,6,,12,,,6,1,2,3,1,1,Aguascalientes,1,1294,203,1,14.26464988
100066,1,1,UMF 8 Aguascalientes,28,6,2016,16,2,16,8,58,1,1,2,2,17,2,,,,4,1,1,2,2,,,,,,,,,,,2,,,,,3,2,,,2,,,1,1,1,1,,2,1,9,1,9,2,,2,,2,,2,,1,9,2,,2,,2,,2,,2,,99,1,1,1,2,99,2,9,3,4,2,5,1,,996,2,1,1,1,1,Aguascalientes,1,1294,203,1,14.053974
100067,1,1,UMF 8 Aguascalientes,28,6,2016,19,12,19,21,58,1,1,1,1,34,1,3,2,1,1,1,2,2,2,,,,,,,,,,,2,,,,,3,2,,,1,1,1,1,1,1,2,1,2,1,10,1,10,2,,2,,2,,2,,1,10,2,,2,,2,,2,,2,,2,1,1,3,2,1,1,10,2,6,,1,7,27,10,2,1,3,1,1,Aguascalientes,1,1294,203,1,14.053974
100068,1,1,UMF 8 Aguascalientes,28,6,2016,15,2,15,11,58,1,2,2,2,7,2,,,,1,1,1,2,2,,,,,,,,,,,2,,,,,2,2,,,2,,,1,1,1,1,,2,1,9,1,9,2,,2,,2,,2,,1,10,2,,2,,2,,2,,2,,1,1,1,3,1,99,1,10,2,6,,5,,,1,2,1,3,1,1,Aguascalientes,1,1294,203,1,14.053974
100069,1,1,UMF 8 Aguascalientes,28,6,2016,12,57,13,5,60,1,1,2,2,2,1,4,3,1,2,1,1,2,2,,,,,,,,,,,1,2,,,,3,2,,,2,,,1,1,1,1,,2,1,9,1,10,2,,2,,2,,2,,1,9,2,,2,,2,,2,,1,10,1,1,1,2,1,1,1,10,2,2,1,999,,,996,1,1,2,1,1,Aguascalientes,1,1294,203,1,14.053974
100070,1,1,UMF 8 Aguascalientes,28,6,2016,14,48,14,55,60,1,1,1,1,1,1,1,,1,1,2,1,2,2,,,,,,,,,,,1,2,,,,3,1,7,1,2,,,1,1,1,1,,1,1,10,1,10,2,,2,,2,,2,,1,10,2,,2,,2,,2,,2,,1,1,1,2,2,1,1,10,2,3,1,12,,,996,2,2,5,1,1,Aguascalientes,1,1294,203,1,14.26464988
100071,1,1,UMF 8 Aguascalientes,28,6,2016,15,56,16,5,60,1,1,1,1,2,1,3,3,1,1,1,1,1,2,,,,,,,,,,,1,2,,,,2,1,3,2,1,3,2,1,1,1,1,,2,1,9,1,9,2,,2,,2,,2,,1,10,2,,2,,2,,2,,2,,99,1,1,5,2,1,1,9,2,6,,6,9,,10,2,2,9,1,1,Aguascalientes,1,1294,203,1,14.26464988
100072,1,1,UMF 8 Aguascalientes,28,6,2016,19,33,19,44,61,1,2,2,2,110,1,2,2,2,1,2,1,2,2,,,,,,,,,,,2,,,,,3,2,,,2,,,1,1,1,1,,2,1,9,1,9,2,,2,,2,,2,,1,8,2,,2,,2,,2,,1,10,1,1,1,3,2,1,1,8,2,5,2,9,,,996,2,2,3,1,1,Aguascalientes,1,1294,203,1,14.26464988
100073,1,1,UMF 8 Aguascalientes,28,6,2016,12,32,12,41,61,1,1,2,2,10,1,1,,1,1,1,2,2,2,,,,,,,,,,,2,,,,,3,1,1,1,1,1,1,1,1,1,1,,2,2,,1,10,2,,2,,2,,2,,1,10,2,,2,,2,,2,,2,,1,1,1,3,2,1,1,9,2,2,1,1,,,8,1,1,1,1,1,Aguascalientes,1,1294,203,1,14.053974
100074,1,1,UMF 8 Aguascalientes,28,6,2016,18,50,18,56,61,1,1,2,2,1,1,1,,1,1,1,1,1,2,,,,,,,,,,,2,,,,,2,2,,,2,,,1,1,1,1,,2,2,,1,10,2,,2,,2,,2,,1,10,2,,2,,2,,2,,2,,2,1,1,3,2,1,1,10,2,6,,1,2,7,8,2,1,2,1,1,Aguascalientes,1,1294,203,1,14.053974
100075,1,1,UMF 8 Aguascalientes,28,6,2016,13,16,13,26,62,1,1,2,3,1,1,3,3,1,1,1,1,2,2,,,,,,,,,,,1,2,,,,2,1,1,1,2,,,1,1,1,1,,2,1,10,1,10,2,,2,,2,,2,,1,10,2,,2,,2,,2,,2,,2,1,1,2,2,1,1,10,2,6,,12,,,996,1,1,1,1,1,Aguascalientes,1,1294,203,1,14.053974
100076,1,1,UMF 8 Aguascalientes,28,6,2016,8,32,8,41,64,1,1,2,2,10,2,,,,2,1,1,2,2,,,,,,,,,,,1,1,1,2,2,2,1,1,1,1,1,1,1,1,1,1,,1,1,10,1,10,2,,2,,2,,2,,2,,2,,2,,2,,2,,2,,1,1,1,2,1,1,1,10,1,6,,12,,,996,1,1,9,1,1,Aguascalientes,1,1294,203,1,14.053974
100077,1,1,UMF 8 Aguascalientes,28,6,2016,11,45,11,52,65,1,1,2,2,2,1,1,,1,4,1,1,2,2,,,,,,,,,,,2,,,,,2,2,,,2,,,1,1,1,1,,2,1,10,1,10,2,,2,,2,,2,,1,10,2,,2,,2,,2,,2,,1,1,1,2,2,1,99,10,3,6,,12,,,996,1,1,2,1,1,Aguascalientes,1,1294,203,1,13.3752059
100078,1,1,UMF 8 Aguascalientes,28,6,2016,13,52,13,58,65,1,1,2,2,1,1,1,,1,1,1,1,2,2,,,,,,,,,,,1,1,2,1,3,3,2,,,2,,,1,1,1,1,,2,2,,1,10,1,10,2,,2,,2,,2,,2,,2,,2,,2,,2,,1,1,1,2,1,1,1,8,2,6,,1,3,7,9,1,1,2,1,1,Aguascalientes,1,1294,203,1,13.3752059
100079,1,1,UMF 8 Aguascalientes,28,6,2016,9,23,9,33,67,1,1,2,2,1,1,1,,1,1,1,1,2,2,,,,,,,,,,,2,,,,,3,2,,,2,,,1,1,1,1,,1,1,10,1,10,2,,2,,1,10,2,,1,10,1,10,2,,2,,2,,2,,1,1,1,5,1,1,1,10,1,1,1,4,,,996,1,2,3,1,1,Aguascalientes,1,1294,203,1,13.57570672
100080,1,1,UMF 8 Aguascalientes,28,6,2016,11,13,11,23,67,1,1,2,2,2,1,1,,1,1,1,1,2,2,,,,,,,,,,,2,,,,,1,1,1,1,2,,,1,1,1,2,10,2,2,,1,10,2,,2,,2,,2,,1,10,2,,2,,2,,2,,2,,1,1,1,2,1,1,1,10,2,6,,12,,,996,1,2,3,1,1,Aguascalientes,1,1294,203,1,13.57570672
100081,1,1,UMF 8 Aguascalientes,28,6,2016,8,41,8,49,68,1,1,2,2,2,2,,,,1,1,1,2,2,,,,,,,,,,,2,,,,,2,2,,,2,,,1,1,1,1,,2,1,10,1,10,2,,2,,2,,2,,1,10,2,,2,,2,,2,,2,,1,1,1,3,1,1,1,10,2,6,,4,,,996,1,1,7,1,1,Aguascalientes,1,1294,203,1,13.3752059
100082,1,1,UMF 8 Aguascalientes,28,6,2016,11,39,11,47,68,1,1,2,2,1,99,,,,4,2,1,2,2,,,,,,,,,,,2,,,,,2,1,1,1,2,,,1,1,1,1,,1,1,9,1,10,1,10,2,,2,,2,,1,10,2,,2,,2,,2,,2,,1,1,1,1,2,1,1,10,1,1,1,12,,,996,1,1,2,1,1,Aguascalientes,1,1294,203,1,13.3752059
100083,1,1,UMF 8 Aguascalientes,28,6,2016,16,27,16,35,68,1,1,2,2,2,1,1,,1,1,2,1,2,2,,,,,,,,,,,1,2,,,,2,1,4,1,2,,,1,1,1,1,,2,1,10,1,10,2,,2,,2,,2,,1,8,2,,2,,2,,2,,2,,1,1,1,3,2,1,99,10,2,6,,2,6,9,996,2,1,5,1,1,Aguascalientes,1,1294,203,1,13.3752059
100084,1,1,UMF 8 Aguascalientes,28,6,2016,9,59,10,8,69,1,1,2,1,1,1,1,,1,1,2,1,2,1,1,5,2,,,,,,2,2,2,,,,,3,1,1,1,1,1,1,1,1,1,1,,1,1,10,1,10,2,,2,,2,,2,,1,10,2,,2,,2,,2,,2,,1,1,1,2,2,1,1,10,4,6,,5,,,996,1,1,3,1,1,Aguascalientes,1,1294,203,1,13.3752059
100085,1,1,UMF 8 Aguascalientes,28,6,2016,12,0,12,6,69,1,1,2,2,1,1,1,,4,5,2,1,2,2,,,,,,,,,,,2,,,,,3,1,1,1,1,1,1,1,1,1,1,,2,2,,1,10,2,,2,,2,,2,,2,,2,,2,,2,,2,,2,,1,1,1,3,2,1,1,10,2,2,1,1,2,7,996,1,1,5,1,1,Aguascalientes,1,1294,203,1,13.3752059
100086,1,1,UMF 8 Aguascalientes,28,6,2016,18,19,18,27,69,1,1,2,2,20,1,1,,1,1,1,1,1,2,,,,,,,,,,,2,,,,,3,1,1,1,1,1,1,1,1,1,1,,2,2,,1,9,2,,2,,2,,2,,2,,2,,2,,2,,2,,2,,1,1,1,3,2,1,1,8,4,4,2,1,4,7,1,2,1,3,1,1,Aguascalientes,1,1294,203,1,13.3752059
100087,1,1,UMF 8 Aguascalientes,28,6,2016,19,30,19,42,71,1,1,2,1,19,1,2,3,1,1,1,1,2,2,,,,,,,,,,,2,,,,,3,2,,,2,,,1,1,1,1,,2,1,10,1,10,2,,2,,2,,2,,1,10,2,,2,,2,,2,,2,,1,1,1,1,2,1,1,10,2,6,,9,81,,996,2,1,1,1,1,Aguascalientes,1,1294,203,1,13.3752059
100088,1,1,UMF 8 Aguascalientes,28,6,2016,13,4,13,14,71,1,1,2,2,2,1,1,,3,2,1,1,2,2,,,,,,,,,,,2,,,,,3,1,1,1,2,,,1,1,1,1,,1,1,10,1,10,2,,2,,2,,2,,1,10,2,,2,,2,,2,,2,,1,1,1,3,1,1,1,10,1,1,1,12,,,996,1,1,2,1,1,Aguascalientes,1,1294,203,1,13.3752059
100089,1,1,UMF 8 Aguascalientes,28,6,2016,14,14,14,26,72,1,1,2,2,25,2,,,,2,2,1,2,2,,,,,,,,,,,2,,,,,2,1,1,1,1,1,1,1,1,1,1,,2,1,10,1,10,2,,2,,1,10,2,,1,10,2,,2,,2,,2,,2,,1,1,1,1,1,1,2,10,4,6,,1,4,,27,1,2,3,1,1,Aguascalientes,1,1294,203,1,13.57570672
100090,1,1,UMF 8 Aguascalientes,28,6,2016,17,12,17,21,73,1,1,2,2,2,1,1,,1,1,1,1,2,1,1,2,2,,,,,,1,1,2,,,,,2,2,,,2,,,1,1,1,1,,1,1,9,1,9,2,,2,,1,8,2,,1,8,2,,2,,2,,2,,2,,1,1,1,3,1,1,1,9,2,6,,4,,,31,2,1,2,1,1,Aguascalientes,1,1294,203,1,13.3752059
100091,1,1,UMF 8 Aguascalientes,28,6,2016,10,29,10,40,80,1,1,2,2,2,1,1,,1,1,1,1,2,2,,,,,,,,,,,2,,,,,3,1,1,1,1,1,1,1,1,1,1,,1,2,,1,8,1,10,2,,2,,2,,1,10,2,,2,,2,,2,,2,,1,1,1,2,1,1,1,10,2,2,1,12,,,996,1,1,1,1,1,Aguascalientes,1,1294,203,1,13.3752059
100092,1,1,UMF 8 Aguascalientes,28,6,2016,15,32,15,39,80,1,1,2,2,2,1,4,3,1,1,1,1,2,2,,,,,,,,,,,2,,,,,3,2,,,2,,,1,1,1,1,,2,1,9,1,9,2,,2,,2,,2,,1,8,2,,2,,2,,2,,2,,1,1,1,2,1,99,1,9,2,6,,5,,,996,2,1,2,1,1,Aguascalientes,1,1294,203,1,13.3752059
100093,1,1,UMF 8 Aguascalientes,28,6,2016,8,53,9,7,80,1,1,2,2,16,1,2,2,3,2,2,1,2,1,1,7,4,3,2,,,,2,2,2,,,,,3,1,4,1,1,4,1,2,2,,,,2,1,10,1,8,2,,2,,2,,2,,2,,2,,2,,2,,1,10,2,,1,1,1,1,2,1,1,10,2,3,99,7,9,1,996,1,2,1,1,1,Aguascalientes,1,1294,203,1,13.57570672
100094,1,1,UMF 8 Aguascalientes,28,6,2016,15,12,15,23,83,1,1,2,2,2,1,1,,1,1,1,1,2,2,,,,,,,,,,,99,,,,,1,1,2,1,2,,,1,1,1,1,,1,2,,1,10,2,,2,,2,,2,,1,8,2,,2,,2,,2,,2,,1,1,1,2,2,1,1,10,2,4,2,12,,,996,2,2,2,1,1,Aguascalientes,1,1294,203,1,13.57570672
100095,1,1,UMF 8 Aguascalientes,28,6,2016,16,0,16,9,84,1,1,2,2,2,1,1,,1,1,1,1,2,2,,,,,,,,,,,2,,,,,3,2,,,1,1,99,1,1,1,1,,2,2,,1,10,1,10,2,,2,,2,,2,,2,,2,,2,,2,,2,,2,1,1,3,2,1,1,10,2,6,,1,2,4,4,2,2,3,1,1,Aguascalientes,1,1294,203,1,13.57570672
200117,1,2,UMF 1 Aguascalientes,30,6,2016,17,4,17,10,18,1,1,2,2,13,1,2,2,4,5,1,2,2,2,,,,,,,,,,,2,,,,,3,2,,,2,,,1,1,1,1,,2,1,2,1,10,2,,2,,2,,2,,1,9,2,,2,,2,,2,,2,,2,1,1,1,2,99,1,9,2,6,,1,11,9,996,1,1,7,2,1,Aguascalientes,1,1081,201,1,12.43426268
200118,1,2,UMF 1 Aguascalientes,30,6,2016,8,53,9,0,18,1,1,2,2,4,2,,,,1,1,1,2,1,1,99,2,,,,,,2,1,1,1,2,2,2,3,2,,,1,1,1,1,1,1,1,,2,1,10,1,10,2,,2,,2,,2,,1,9,2,,2,,2,,2,,2,,1,1,1,3,2,1,1,10,2,6,,12,,,996,1,1,6,2,1,Aguascalientes,1,1081,201,1,12.43426268
200120,1,2,UMF 1 Aguascalientes,30,6,2016,12,42,12,50,19,1,1,2,2,7,2,,,,1,1,1,2,2,,,,,,,,,,,2,,,,,3,2,,,2,,,2,2,,,,1,2,,1,9,2,,2,,2,,2,,2,,2,,2,,2,,2,,2,,1,1,1,5,1,99,2,9,1,6,,1,,,996,2,1,7,2,1,Aguascalientes,1,1081,201,1,12.43426268
200121,1,2,UMF 1 Aguascalientes,30,6,2016,17,37,17,43,19,1,1,2,2,6,2,,,,1,1,1,2,2,,,,,,,,,,,2,,,,,3,2,,,2,,,1,1,1,1,,2,1,9,1,10,2,,2,,2,,2,,1,5,2,,2,,2,,2,,2,,1,1,1,2,1,1,2,9,3,2,1,1,4,,996,2,1,4,2,1,Aguascalientes,1,1081,201,1,12.43426268